Hexyl isovalerate

Van Den Dool and Kratz RI, non-polar column, temperature ramp

View large format table.

Column type Active phase I Reference Comment
CapillaryHP-5MS1243.Saroglou, Dorizas, et al., 200630. m/0.25 mm/0.25 μm, He, 60. C @ 5. min, 4. K/min; Tend: 280. C
CapillaryHP-51243.Javidnia, Miri, et al., 2005He, 3. K/min; Column length: 30. m; Column diameter: 0.25 mm; Tstart: 60. C; Tend: 260. C
CapillaryHP-51245.Flamini, Luigi Cioni, et al., 200330. m/0.25 mm/0.25 μm, N2, 60. C @ 10. min, 5. K/min; Tend: 220. C

Van Den Dool and Kratz RI, non-polar column, custom temperature program

View large format table.

Column type Active phase I Reference Comment
CapillaryBPX-51211.Cardeal, da Silva, et al., 200630. m/0.25 mm/0.25 μm; Program: 35C(5min) => 3C/min => 210C => 40C/min => 240C (4min)

Normal alkane RI, non-polar column, temperature ramp

View large format table.

Column type Active phase I Reference Comment
CapillaryHP-51247.Kahriman, Tosun, et al., 201130. m/0.32 mm/0.25 μm, Helium, 60. C @ 2. min, 3. K/min; Tend: 240. C
CapillaryHP-51243.Radulovic, Dordevic, et al., 201030. m/0.25 mm/0.25 μm, Hydrogen, 5. K/min; Tstart: 70. C; Tend: 290. C
CapillaryHP-5 MS1241.Radulovic, Dordevic, et al., 2010, 230. m/0.25 mm/0.25 μm, Helium, 5. K/min, 290. C @ 10. min; Tstart: 70. C
CapillaryDB-1-MS1228.Takeoka, Hobbs, et al., 201060. m/0.25 mm/0.25 μm, Helium, 30. C @ 4. min, 2. K/min, 200. C @ 35. min
CapillaryVF-51238.Li and Zhao, 200930. m/0.25 mm/0.25 μm, Helium, 60. C @ 2. min, 10. K/min, 300. C @ 10. min
CapillaryDB-11228.Kumazawa, Itobe, et al., 200830. m/0.25 mm/0.25 μm, He, 5. K/min; Tstart: 30. C; Tend: 210. C
CapillaryPE-51244.Singh, Raina, et al., 200530. m/0.32 mm/0.25 μm, H2, 60. C @ 2. min, 5. K/min, 230. C @ 4. min
CapillaryHP-51242.Sajjadi and Mehregan, 200330. m/0.25 mm/0.25 μm, He, 4. K/min; Tstart: 60. C; Tend: 280. C
CapillaryOV-1011224.Tkachenko and Zenkevich, 1987Helium, 40. C @ 0. min, 2. K/min, 200. C @ 0. min; Column length: 50. m; Column diameter: 0.25 mm
CapillaryOV-1011240.Tkachenko and Zenkevich, 1987Helium, 40. C @ 0. min, 5. K/min, 200. C @ 0. min; Column length: 50. m; Column diameter: 0.25 mm

Normal alkane RI, non-polar column, custom temperature program

View large format table.

Column type Active phase I Reference Comment
CapillaryHP-51247.Kahriman, Tosun, et al., 201130. m/0.32 mm/0.25 μm, Helium; Program: not specified
CapillaryDB-1-MS1228.Takeoka, Hobbs, et al., 201060. m/0.25 mm/0.25 μm, Helium; Program: not specified
CapillaryCP Sil 8 CB1244.Nivinskienë, Butkienë, et al., 200550. m/0.32 mm/0.25 μm, He; Program: 60C(1min) => 5C/min => 160C => 5C/min => 250C(3min)
CapillaryDB-5MS1240.Maia, Andrade, et al., 200430. m/0.25 mm/0.25 μm, He; Program: 40C => 2C/min => 60C => 4C/min => 260C
CapillarySE-301229.Vinogradov, 2004Program: not specified

Normal alkane RI, polar column, temperature ramp

View large format table.

Column type Active phase I Reference Comment
CapillaryDB-Wax1437.Kumazawa, Itobe, et al., 200830. m/0.25 mm/0.25 μm, He, 5. K/min; Tstart: 30. C; Tend: 210. C

Normal alkane RI, polar column, custom temperature program

View large format table.

Column type Active phase I Reference Comment
CapillaryInnowax FSC1457.Bardakci, Demirci, et al., 201260. m/0.25 mm/0.25 μm, Helium; Program: 60 0C (10 min) 4 0C/min -> 220 0C 1 0C/min -> 240 0C
CapillaryCarbowax 20M1433.Vinogradov, 2004Program: not specified
CapillaryDB-Wax1433.Miranda, Nogueira, et al., 200130. m/0.25 mm/0.25 μm, He; Program: 25 0C (0.5 min) 50 K/min -> 50 0C 3.5 K/min -> 150 0C 7.5 K/min -> 240 0C

References

Saroglou, Dorizas, et al., 2006
Saroglou, V.; Dorizas, N.; Kypriotakis, Z.; Skaltsa, H.D., Analysis of the essential oil composition of eight Anthemis species from Greece, J. Chromatogr. A, 2006, 1104, 1-2, 313-322, https://doi.org/10.1016/j.chroma.2005.11.087 . [all data]

Javidnia, Miri, et al., 2005
Javidnia, K.; Miri, R.; Jamalian, A., Composition of the essential oil of Salvia macrosiphon Boiss. from Iran, Flavour Fragr. J., 2005, 20, 5, 542-543, https://doi.org/10.1002/ffj.1468 . [all data]

Flamini, Luigi Cioni, et al., 2003
Flamini, G.; Luigi Cioni, P.; Morelli, I., Differences in the fragrances of pollen, leaves, and floral parts of garland (Chrysanthemum coronarium) and composition of the essential oils from flowerheads and leaves, J. Agric. Food Chem., 2003, 51, 8, 2267-2271, https://doi.org/10.1021/jf021050l . [all data]

Cardeal, da Silva, et al., 2006
Cardeal, Z.L.; da Silva, M.D.R.G.; Marriott, P.J., Comprehensive two-dimensional gas chromatography/mass spectrometric analysis of pepper volatiles, Rapid Commun. Mass Spectrom., 2006, 20, 19, 2823-2836, https://doi.org/10.1002/rcm.2665 . [all data]

Kahriman, Tosun, et al., 2011
Kahriman, N.; Tosun, G.; Terzioglu, S.; Karaoglu, S.A.; Yayh, N., Chemical composition and antimicrobial activity of the essential oils from the flower, leaf, and stem of Senecio pandurifolis, Rec. Nat. Prod., 2011, 5, 2, 82-91. [all data]

Radulovic, Dordevic, et al., 2010
Radulovic, N.S.; Dordevic, N.D.; Palic, R.M., Volatiles of Pleurospermum austriacum (L.) Hoffm. (Apiaceae), J. Serbian Chem. Soc., 2010, 75, 12, 1-11, https://doi.org/10.2298/JSC100323127R . [all data]

Radulovic, Dordevic, et al., 2010, 2
Radulovic, N.; Dordevic, N.; Markovic, M.; Palic, R., Volatile constituents of Glechoma Hirsuta Waldst. Kit. and G. Hederacea L. (Lamiaceae), Bull. Chem. Soc. Ethiop., 2010, 24, 1, 67-76, https://doi.org/10.4314/bcse.v24i1.52962 . [all data]

Takeoka, Hobbs, et al., 2010
Takeoka, G.R.; Hobbs, C.; Byeoung-Soo, P., Volatile constituents of the aerial parts of Salvia apiana Jepson, J. Essential Oil. Res., 2010, 22, 3, 241-244, https://doi.org/10.1080/10412905.2010.9700314 . [all data]

Li and Zhao, 2009
Li, L.; Zhao, J., Determination of the volatile composition of Rhodobryum giganteum (Schwaegr.) Par. (Bryaceae) using solid-phase microextraction and gas chromatography / mass spectrometry (GC/MS), Molecules, 2009, 14, 6, 2195-2201, https://doi.org/10.3390/molecules14062195 . [all data]

Kumazawa, Itobe, et al., 2008
Kumazawa, K.; Itobe, T.; Nishimura, O.; Hamaguchi, T., A new approach to estimate the in-mouth release characteristics of odorants in chewing gum, Food Science and Technology Research, 2008, 14, 3, 269-276, https://doi.org/10.3136/fstr.14.269 . [all data]

Singh, Raina, et al., 2005
Singh, A.K.; Raina, V.K.; Naqvi, A.A.; Patra, N.K.; Kumar, B.; Ram, P.; Khanuja, S.P.S., Essential oil composition and chemoarrays of menthol mint (Mentha arvensis L. f. piperascens Malinvaud ex. Holmes) cultivars, Flavour Fragr. J., 2005, 20, 3, 302-305, https://doi.org/10.1002/ffj.1417 . [all data]

Sajjadi and Mehregan, 2003
Sajjadi, S.E.; Mehregan, I., Chemical composition of the essential oil of Prangos Asperula Boiss. subsp. haussknechtii (Boiss.) Hernst. et Heyn fruits, 2003, retrieved from http://www1.tums.ac.ir/daru/daru2%2020003/Dr%20Sajadi.PDF. [all data]

Tkachenko and Zenkevich, 1987
Tkachenko, K.G.; Zenkevich, I.G., Composition of Essential Oils from Fruits of Some Species Heracleum L., Rastitel'nye Resursy (Rus.), 1987, 1, 87-91. [all data]

Nivinskienë, Butkienë, et al., 2005
Nivinskienë, O.; Butkienë, R.; Mockutë, D., Chemical composition of seed (fruit) essential oils of Angelica archangelica L. growing wild in Lithuania, Chemija, 2005, 16, 3-4, 51-54. [all data]

Maia, Andrade, et al., 2004
Maia, J.G.S.; Andrade, E.H.A.; Zoghbi, M.G.B., Aroma volatiles from two fruit varieties of jackfruit (Artocarpus heterophyllus Lam.), Food Chem., 2004, 85, 2, 195-197, https://doi.org/10.1016/S0308-8146(03)00292-9 . [all data]

Vinogradov, 2004
Vinogradov, B.A., Production, composition, properties and application of essential oils, 2004, retrieved from http://viness.narod.ru. [all data]

Bardakci, Demirci, et al., 2012
Bardakci, H.; Demirci, B.; Yesilada, E.; Kirmizibekmez, H.; Naser, K.H.C., Chemical composition of the essential oil of the subterranean parts of Valeriana alliariifolia, Rec. Nat. Prod., 2012, 6, 1, 89-92. [all data]

Miranda, Nogueira, et al., 2001
Miranda, E.J.F.; Nogueira, R.I.; Pontes, S.M.; Rezende, C.M., Odour-active compounds of banana passa identified by aroma extract dilution analysis, Flavour Fragr. J., 2001, 16, 4, 281-285, https://doi.org/10.1002/ffj.997 . [all data]