1-Octanol, 3,7-dimethyl-

Van Den Dool and Kratz RI, polar column, temperature ramp

Data compiled by: NIST Mass Spectrometry Data Center, William E. Wallace, director

Column type CapillaryCapillaryCapillaryCapillary
Active phase DB-WaxDB-WaxDB-WaxDB-Wax
Column length (m) 30.30.30.30.
Carrier gas
Substrate
Column diameter (mm) 0.250.250.250.25
Phase thickness (μm)
Tstart (C) 50.50.50.50.
Tend (C) 240.240.240.240.
Heat rate (K/min) 2.2.2.2.
Initial hold (min)
Final hold (min)
I 1666.31666.41664.81666.4
ReferenceChang, Sheng, et al., 1989Chang, Sheng, et al., 1989Chang, Sheng, et al., 1989Chang, Sheng, et al., 1989
Comment MSDC-RI MSDC-RI MSDC-RI MSDC-RI

Normal alkane RI, polar column, temperature ramp

Data compiled by: NIST Mass Spectrometry Data Center, William E. Wallace, director

Column type Capillary
Active phase DB-Wax
Column length (m) 60.
Carrier gas He
Substrate
Column diameter (mm) 0.25
Phase thickness (μm) 0.25
Tstart (C) 40.
Tend (C) 200.
Heat rate (K/min) 2.
Initial hold (min) 2.
Final hold (min)
I 1664.
ReferenceUmano, Nakahara, et al., 1999
Comment MSDC-RI

Condensed phase thermochemistry data

Data compiled by: Eugene S. Domalski and Elizabeth D. Hearing

Constant pressure heat capacity of liquid

Cp,liquid (J/mol*K) Temperature (K) Reference
367.21298.15Caceres-Alonso, Costas, et al., 1988

References

Chang, Sheng, et al., 1989
Chang, L.P.; Sheng, L.S.; Yang, M.Z.; An, D.K., Retention index of essential oil in temperature-programmed capillary column gas chromatography, Acta Pharm. Sin., 1989, 24, 11, 847-852. [all data]