Hexanedioic acid, dipropyl ester

Van Den Dool and Kratz RI, non-polar column, temperature ramp

Data compiled by: NIST Mass Spectrometry Data Center, William E. Wallace, director

Column type CapillaryCapillary
Active phase 5 % Phenyl methyl siloxane5 % Phenyl methyl siloxane
Column length (m) 25.30.
Carrier gas
Substrate
Column diameter (mm) 0.310.25
Phase thickness (μm) 0.310.5
Tstart (C) 50.50.
Tend (C) 250.300.
Heat rate (K/min) 5.8.
Initial hold (min) 1.1.
Final hold (min) 10.10.
I 1577.1588.
ReferenceGuisto, Smith, et al., 1993Guisto, Smith, et al., 1993
Comment MSDC-RI MSDC-RI

Normal alkane RI, non-polar column, temperature ramp

Data compiled by: NIST Mass Spectrometry Data Center, William E. Wallace, director

Column type Capillary
Active phase Ultra-1
Column length (m) 25.
Carrier gas He
Substrate
Column diameter (mm) 0.32
Phase thickness (μm) 0.25
Tstart (C) 80.
Tend (C) 260.
Heat rate (K/min) 3.
Initial hold (min)
Final hold (min)
I 1540.
ReferenceOkumura, 1991
Comment MSDC-RI

Kovats' RI, non-polar column, isothermal

Data compiled by: NIST Mass Spectrometry Data Center, William E. Wallace, director

Column type Packed
Active phase SE-30
Column length (m) 2.
Carrier gas
Substrate
Column diameter (mm)
Phase thickness (μm)
Temperature (C) 220.
I 1569.
ReferenceZulaïca and Guiochon, 1963
Comment MSDC-RI

References

Guisto, Smith, et al., 1993
Guisto, R.; Smith, S.R.; Stuart, J.D., Gas chromatographic retention indices, mass, and infrared spectra of industrially important adipate esters, J. Chromatogr. Sci., 1993, 31, 6, 225-230, https://doi.org/10.1093/chromsci/31.6.225 . [all data]