Geranyl propionate

Kovats' RI, non-polar column, isothermal

View large format table.

Column type Active phase Temperature (C) I Reference Comment
CapillarySE-30100.1449.8Tudor, 199740. m/0.35 mm/0.35 μm

Kovats' RI, non-polar column, temperature ramp

View large format table.

Column type Active phase I Reference Comment
CapillaryCross-Linked Methylsilicone1449.Rajeswara Rao, Kaul, et al., 200250. m/0.2 mm/0.25 μm, He, 4. K/min; Tstart: 100. C; Tend: 280. C
CapillaryBP-11453.Shawl, Srivastava, et al., 200230. m/0.32 mm/0.25 μm, N2, 5. K/min, 220. C @ 13. min; Tstart: 60. C
CapillaryBP-11448.Jain, Aggarwal, et al., 200125. m/0.55 mm/0.25 μm, N2, 5. K/min, 220. C @ 15. min; Tstart: 60. C
CapillaryHP-11447.Rajeswara Rao, 200125. m/0.2 mm/0.25 μm, He, 4. K/min; Tstart: 100. C; Tend: 220. C
CapillaryBP-11449.Kulkarni, Mallavarapu, et al., 1998N2, 5. K/min; Column length: 25. m; Column diameter: 0.25 mm; Tstart: 60. C; Tend: 220. C
CapillaryMethyl Silicone1446.Mallavarapu, Rao, et al., 1998N2, 5. K/min; Column length: 25. m; Column diameter: 0.5 mm; Tstart: 60. C; Tend: 220. C

Kovats' RI, non-polar column, custom temperature program

View large format table.

Column type Active phase I Reference Comment
CapillaryBP-11447.Khan, Srivastava, et al., 200325. m/0.25 mm/0.25 μm, N2; Program: 60C => 5C/min => 220C (5min) => 3C/min => 245 C (5min)
CapillaryHP-51475.Shellie and Marriott, 200330. m/0.25 mm/0.25 μm, He; Program: not specified
CapillaryBP-11447.Khan, Srivastava, et al., 200230. m/0.32 mm/0.25 μm, N2; Program: 60 C 5 C/min -> 220 C (5 min) 3 C/min -> 245 C (5 min)

Kovats' RI, polar column, isothermal

View large format table.

Column type Active phase Temperature (C) I Reference Comment
CapillaryCarbowax 20M150.1819.Tudor, Moldovan, et al., 1999Phase thickness: 0.08 μm
PackedCarbowax 20M150.1834.ter Heide, 1968N2, Embacel; Column length: 2.5 m

Kovats' RI, polar column, temperature ramp

View large format table.

Column type Active phase I Reference Comment
CapillaryCarbowax 20M1817.Kulkarni, Mallavarapu, et al., 1998N2, 5. K/min; Column length: 25. m; Column diameter: 0.25 mm; Tstart: 60. C; Tend: 200. C
CapillaryCarbowax 20M1823.Mallavarapu, Rao, et al., 1998N2, 5. K/min; Column length: 25. m; Column diameter: 0.5 mm; Tstart: 60. C; Tend: 200. C

Van Den Dool and Kratz RI, non-polar column, temperature ramp

View large format table.

Column type Active phase I Reference Comment
CapillaryDB-11448.Ramezani, Behravan, et al., 200630. m/0.25 mm/0.25 μm, He, 2.5 K/min; Tstart: 50. C; Tend: 265. C
Capillary5 % Phenyl methyl siloxane1430.Estevez, Ventanas, et al., 200530. m/0.25 mm/1. μm, He, 40. C @ 10. min, 7. K/min, 250. C @ 5. min
CapillaryHP-5MS1478.Pino, Mesa, et al., 200530. m/0.25 mm/0.25 μm, He, 60. C @ 2. min, 4. K/min, 250. C @ 20. min
CapillaryHP-51476.Isidorov, Krajewska, et al., 200430. m/0.25 mm/0.25 μm, He, 3. K/min; Tstart: 40. C; Tend: 250. C
CapillaryBP-11451.Raina, Kumar, et al., 200430. m/0.32 mm/0.25 μm, N2, 5. K/min, 220. C @ 13. min; Tstart: 60. C
CapillaryDB-51444.bin Jantan, Yassin, et al., 200330. m/0.25 mm/0.25 μm, N2, 75. C @ 10. min, 3. K/min; Tend: 230. C
CapillaryHP-51479.Shellie and Marriott, 200330. m/0.25 mm/0.25 μm, He, 3. K/min; Tstart: 40. C; Tend: 240. C
CapillaryDB-51475.Miri, Ramezani, et al., 2002He, 4. K/min; Column length: 25. m; Column diameter: 0.25 mm; Tstart: 70. C; Tend: 260. C
CapillarySE-301444.bin Jantan, Basni, et al., 2001N2, 60. C @ 10. min, 3. K/min, 180. C @ 1. min; Column length: 25. m; Column diameter: 0.20 mm
CapillaryHP-51475.Song, Sawamura, et al., 200030. m/0.25 mm/0.25 μm, He, 2. K/min; Tstart: 70. C; Tend: 230. C

Van Den Dool and Kratz RI, non-polar column, custom temperature program

View large format table.

Column type Active phase I Reference Comment
Capillary5 % Phenyl methyl siloxane1450.Sacchetti, Maietti, et al., 200530. m/0.32 mm/0.15 μm, He; Program: 45C => 1C/min => 100C => 5C/min => 250C (10min)

Van Den Dool and Kratz RI, polar column, temperature ramp

View large format table.

Column type Active phase I Reference Comment
CapillaryDB-Wax1814.Njoroge, Koaze, et al., 200560. m/0.25 mm/0.25 μm, N2, 70. C @ 2. min, 2. K/min, 230. C @ 20. min
CapillaryDB-Wax1830.Choi and Sawamura, 200060. m/0.25 mm/0.25 μm, N2, 70. C @ 2. min, 2. K/min, 230. C @ 20. min

Normal alkane RI, non-polar column, temperature ramp

View large format table.

Column type Active phase I Reference Comment
CapillaryDB-51478.Scrivanti, Anton, et al., 200930. m/0.25 mm/0.25 μm, Nitrogen, 2. K/min; Tstart: 40. C; Tend: 230. C
CapillaryHP-51475.Aicha, Ines, et al., 200830. m/0.25 mm/0.25 μm, Helium, 50. C @ 3. min, 9. K/min, 280. C @ 3. min
CapillaryHP-5MS1485.Argyropoulou, Daferera, et al., 200730. m/0.25 mm/0.25 μm, He, 3. K/min; Tstart: 60. C; Tend: 240. C
CapillaryHP-5MS1473.Ferhat, Meklati, et al., 200730. m/0.25 mm/0.25 μm, He, 60. C @ 8. min, 2. K/min, 250. C @ 15. min
CapillaryHP-51487.Ristic, Krivokuca-Dokic, et al., 200730. m/0.25 mm/0.25 μm, Helium, 4. K/min; Tstart: 40. C; Tend: 260. C
CapillaryNB-301452.Orav, Raal, et al., 200630. m/0.2 mm/0.25 μm, He, 2. K/min; Tstart: 50. C; Tend: 250. C
CapillaryDB-51475.Kalvandi, Sefidkon, et al., 200460. m/0.25 mm/0.25 μm, He, 40. C @ 4. min, 4. K/min; Tend: 280. C
CapillaryDB-11451.Palá-Paúl, Pérez-Alonso, et al., 200250. m/0.25 mm/0.25 μm, N2, 4. K/min; Tstart: 80. C; Tend: 225. C
CapillaryBP-11448.Gupta, Mallavarapu, et al., 200130. m/0.25 mm/0.25 μm, N2, 5. K/min; Tstart: 60. C; Tend: 220. C
CapillaryBP-11447.Rajeswara, Kaul, et al., 1996N2, 5. K/min; Column length: 25. m; Column diameter: 0.50 mm; Tstart: 60. C; Tend: 220. C

Normal alkane RI, non-polar column, custom temperature program

View large format table.

Column type Active phase I Reference Comment
CapillaryHP-5 MS1477.Nance and Setzer, 201130. m/0.25 mm/0.25 μm, Helium; Program: 40 0C (10 min) 3 0C/min -> 200 0C 2 0C/min -> 220 0C
CapillaryDB-11453.Delort and Jaquier, 200960. m/0.25 mm/0.25 μm, Helium; Program: 50 0C (5 min) 3 0C/min -> 120 0C 5 0C/min -> 250 0C (3 min) 15 0C/min -> 300 0C (20 min)
CapillaryHP-51478.Ristic, Krivokuca-Dokic, et al., 200730. m/0.25 mm/0.25 μm, Helium; Program: not specified
CapillaryDB-11461.Miguel, Simões, et al., 200430. m/0.25 mm/0.25 μm, He; Program: 45C => 3C/min => 175C => 15C/min => 300C (10min)
CapillarySE-301424.Vinogradov, 2004Program: not specified
CapillaryCP Sil 5 CB1447.Weyerstahl, Marschall, et al., 199925. m/0.25 mm/0.39 μm, N2; Program: not specified
CapillaryDB-11425.Vernin, 1993Program: not specified

Normal alkane RI, polar column, temperature ramp

View large format table.

Column type Active phase I Reference Comment
CapillaryCarbowax1802.Ferhat, Meklati, et al., 200760. m/0.2 mm/0.25 μm, He, 60. C @ 8. min, 2. K/min, 250. C @ 15. min
CapillaryDB-Wax1815.Lan Phi N.T., Nishiyama C., et al., 200660. m/0.25 mm/0.25 μm, 70. C @ 2. min, 2. K/min, 230. C @ 20. min
CapillaryNB-20M1770.Orav, Raal, et al., 200630. m/0.2 mm/0.25 μm, He, 2. K/min; Tstart: 50. C; Tend: 250. C
CapillaryCarbowax 20M1799.Babu and Kaul, 200560. m/0.25 mm/0.25 μm, N2, 40. C @ 2. min, 10. K/min, 190. C @ 15. min
CapillaryDB-Wax1814.Njoroge, Koaze, et al., 2005, 260. m/0.25 mm/0.25 μm, N2, 70. C @ 2. min, 2. K/min, 230. C @ 20. min
CapillaryDB-Wax1828.Choi, 200460. m/0.25 mm/0.25 μm, N2, 70. C @ 2. min, 2. K/min, 230. C @ 20. min
CapillaryDB-Wax1830.Choi, 2004, 260. m/0.25 mm/0.25 μm, N2, 70. C @ 2. min, 2. K/min, 230. C @ 20. min
CapillaryDB-Wax1827.Sawamura, Son, et al., 200460. m/0.25 mm/0.25 μm, 70. C @ 2. min, 2. K/min, 230. C @ 20. min
CapillaryDB-Wax1827.Sawamura, Sou, et al., 200460. m/0.25 mm/0.25 μm, Nitrogen, 70. C @ 2. min, 2. K/min; Tend: 230. C

Normal alkane RI, polar column, custom temperature program

View large format table.

Column type Active phase I Reference Comment
CapillaryInnowax1812.Aicha, Ines, et al., 200830. m/0.25 mm/0.25 μm, Helium; Program: not specified
CapillaryCarbowax 20M1799.Vinogradov, 2004Program: not specified
CapillaryWAX 511800.Vernin, 1993Program: not specified

References

Tudor, 1997
Tudor, E., Temperature dependence of the retention index for perfumery compounds on a SE-30 glass capillary column. I. Linear equations, J. Chromatogr. A, 1997, 779, 1-2, 287-297, https://doi.org/10.1016/S0021-9673(97)00453-6 . [all data]

Rajeswara Rao, Kaul, et al., 2002
Rajeswara Rao, B.R.; Kaul, P.N.; Syamasundar, K.V.; Ramesh, S., Water soluble fractions of rose scented geranium (Pelargonium species) essential oil, Bioresour. Technol., 2002, 84, 3, 243-246, https://doi.org/10.1016/S0960-8524(02)00057-3 . [all data]

Shawl, Srivastava, et al., 2002
Shawl, A.S.; Srivastava, S.K.; Syamasundar, K.V.; Tripathi, S.; Raina, V.K., Essential oil composition of Achillea millefolium L. growing wild in Kashmir, India, Flavour Fragr. J., 2002, 17, 3, 165-168, https://doi.org/10.1002/ffj.1074 . [all data]

Jain, Aggarwal, et al., 2001
Jain, N.; Aggarwal, K.K.; Syamasundar, K.V.; Srivastava, S.K.; Kumar, S., Essential oil composition of geranium (Pelargonium sp.) from the plains of Northern India, Flavour Fragr. J., 2001, 16, 1, 44-46, https://doi.org/10.1002/1099-1026(200101/02)16:1<44::AID-FFJ943>3.0.CO;2-X . [all data]

Rajeswara Rao, 2001
Rajeswara Rao, B.R., Biomass and essential oil yields of rainfed palmarosa (Cymbopogon martinii (Roxb.) Wats. var. motia Burk.) supplied with different levels of organic manure and fertilizer nitrogen in semi-arid tropical climate, Ind. Crops Prod., 2001, 14, 3, 171-178, https://doi.org/10.1016/S0926-6690(01)00081-4 . [all data]

Kulkarni, Mallavarapu, et al., 1998
Kulkarni, R.N.; Mallavarapu, G.R.; Baskaran, K.; Ramesch, S.; Kumar, S., Composition of the essential oils of two isomenthone-rich variants of geranium (Pelargonium sp.), Flavour Fragr. J., 1998, 13, 6, 389-392, https://doi.org/10.1002/(SICI)1099-1026(199811/12)13:6<389::AID-FFJ757>3.0.CO;2-2 . [all data]

Mallavarapu, Rao, et al., 1998
Mallavarapu, G.R.; Rao, B.R.R.; Kaul, P.N.; Ramesh, S.; Bhattacharya, A.K., Volatile constituents of the essential oils of the seeds and the herb of palmarosa (Cymbopogon martinii (Roxb.) Wats. var. motia Burk.), Flavour Fragr. J., 1998, 13, 3, 167-169, https://doi.org/10.1002/(SICI)1099-1026(199805/06)13:3<167::AID-FFJ719>3.0.CO;2-B . [all data]

Khan, Srivastava, et al., 2003
Khan, M.; Srivastava, S.K.; Jain, N.; Syamasundar, K.V.; Yadav, A.K., Chemical composition of fruit and stem essential oils of Lantana camara from northern India, Flavour Fragr. J., 2003, 18, 5, 376-379, https://doi.org/10.1002/ffj.1197 . [all data]

Shellie and Marriott, 2003
Shellie, R.A.; Marriott, P.J., Comprehensive two-dimensional gas chromatography-mass spectrometry analysis of Pelargonium graveolens essential oil using rapid scanning quadrupole mass spectrometry, Analyst, 2003, 128, 7, 879-883, https://doi.org/10.1039/b304371a . [all data]

Khan, Srivastava, et al., 2002
Khan, M.; Srivastava, S.K.; Syamasundar, K.V.; Singh, M.; Naqvi, A.A., Chemical composition of leaf and flower essential oil of Lantana camara from India, Flavour Fragr. J., 2002, 17, 1, 75-77, https://doi.org/10.1002/ffj.1047 . [all data]

Tudor, Moldovan, et al., 1999
Tudor, E.; Moldovan, D.; Zârna, N., Temperature dependence of the retention index for perfumery compounds on two carbowax-20M glass capillary columns with different film thickness. 2, Rev. Roum. Chim., 1999, 44, 7, 665-675. [all data]

ter Heide, 1968
ter Heide, R., Studies on terpenes. II. Characterization of monoterpene esters by gas and thin-layer chromatography, Z. Anal. Chem., 1968, 236, 215-227. [all data]

Ramezani, Behravan, et al., 2006
Ramezani, M.; Behravan, J.; Yazdinezhad, A., Composition and antimicrobial activity of the volatile oil of Artemisia kopetdaghensis Krasch., M.Pop. Linecz ex Poljak from Iran, Flavour Fragr. J., 2006, 21, 6, 869-871, https://doi.org/10.1002/ffj.1644 . [all data]

Estevez, Ventanas, et al., 2005
Estevez, M.; Ventanas, S.; Ramirez, R.; Cava, R., Influence of the Addition of Rosemary Essential Oil on the Volatiles Pattern of Porcine Frankfurters, J. Agric. Food Chem., 2005, 53, 21, 8317-8324, https://doi.org/10.1021/jf051025q . [all data]

Pino, Mesa, et al., 2005
Pino, J.A.; Mesa, J.; Muñoz, Y.; Martí, M.P.; Marbot, R., Volatile components from mango (Mangifera indica L.) cultivars, J. Agric. Food Chem., 2005, 53, 6, 2213-2223, https://doi.org/10.1021/jf0402633 . [all data]

Isidorov, Krajewska, et al., 2004
Isidorov, V.A.; Krajewska, U.; Vinogorova, V.T.; Vetchinnikova, L.V.; Fuksman, I.L.; Bal, K., Gas chromatographic analysis of essential oil from buds of different birch species with preliminary partition of components, Biochem. Syst. Ecol., 2004, 32, 1, 1-13, https://doi.org/10.1016/S0305-1978(03)00175-3 . [all data]

Raina, Kumar, et al., 2004
Raina, V.K.; Kumar, A.; Srivastava, S.K.; Syamsundar, K.V.; Kahol, A.P., Essential oil composition of 'kewda' (Pandanus odoratissimus) from India, Flavour Fragr. J., 2004, 19, 5, 434-436, https://doi.org/10.1002/ffj.1331 . [all data]

bin Jantan, Yassin, et al., 2003
bin Jantan, I.; Yassin, M.S.M.; Chin, C.B.; Chen, L.L.; Sim. N.L., Antifungal activity of the essential oils of nine Zingiberaceae species, Pharm. Biol., 2003, 41, 5, 392-397, https://doi.org/10.1076/phbi.41.5.392.15941 . [all data]

Miri, Ramezani, et al., 2002
Miri, R.; Ramezani, M.; Javidnia, K.; Ahmadi, L., Composition of the volatile oil of Thymus transcaspicus Klokov from Iran, Flavour Fragr. J., 2002, 17, 4, 245-246, https://doi.org/10.1002/ffj.1104 . [all data]

bin Jantan, Basni, et al., 2001
bin Jantan, I.; Basni, I.; Ahmad, A.S.; Ali, N.A.M.; Ahmad, A.R.; Ibrahim, H., Constituents of the rhizome oils of Boesenbergia pandurata (Roxb.) Schlecht from Malaysia, Indonesia and Thailand, Flavour Fragr. J., 2001, 16, 2, 110-112, https://doi.org/10.1002/ffj.956 . [all data]

Song, Sawamura, et al., 2000
Song, H.S.; Sawamura, M.; Ito, T.; Kawashimo, K.; Ukeda, H., Quantitative determination of characteric flavour of Citrus junos (yuzu) peel oil, Flavour Fragr. J., 2000, 15, 4, 245-250, https://doi.org/10.1002/1099-1026(200007/08)15:4<245::AID-FFJ904>3.0.CO;2-V . [all data]

Sacchetti, Maietti, et al., 2005
Sacchetti, G.; Maietti, S.; Muzzoli, M.; Scaglianti, M.; Manfredini, S.; Radice, M.; Bruni, R., Comparative evaluation of 11 essential oils of different origin as functional antioxidants, antiradicals and antimicrobials in foods, Food Chem., 2005, 91, 4, 621-632, https://doi.org/10.1016/j.foodchem.2004.06.031 . [all data]

Njoroge, Koaze, et al., 2005
Njoroge, S.M.; Koaze, H.; Karanja, P.N.; Sawamura, M., Volatile Constituents of Redblush Grapefruit ( Citrus paradisi) and Pummelo ( Citrus grandis) Peel Essential Oils from Kenya, J. Agric. Food Chem., 2005, 53, 25, 9790-9794, https://doi.org/10.1021/jf051373s . [all data]

Choi and Sawamura, 2000
Choi, H.-S.; Sawamura, M., Composition of the essential oil of Citrus tamurana Hort. ex Tanaka (Hyuganatsu), J. Agric. Food Chem., 2000, 48, 10, 4868-4873, https://doi.org/10.1021/jf000651e . [all data]

Scrivanti, Anton, et al., 2009
Scrivanti, L.R.; Anton, A.M.; Zygadlo, J.A., Essential oil conposition of Bothriochloa Kuntze (Poaceae) from South America and their chemotaxonomy, Biochem. Systematics Ecol., 2009, 37, 3, 206-213, https://doi.org/10.1016/j.bse.2009.03.009 . [all data]

Aicha, Ines, et al., 2008
Aicha, N.; Ines, S.; Mohamed, B.S.; Ines, B.; Soumaya, K.; Kamel, G.; Mohamed, N.; Imed, C.; Mohamed, H.; Leila, C.-G., Chemical composition, mutagenic and antimutagenic activities of essential oils from (Tunisian) Artemisia campestris and Artemisia herba-alba, J. Ess. Oil Res., 2008, 20, 5, 471-477. [all data]

Argyropoulou, Daferera, et al., 2007
Argyropoulou, C.; Daferera, D.; Tarantilis, P.A.; Fasseas, C.; Polissiou, M., Chemical composition of the essential oil from leaves of Lippia citriodora H.B.K. (Verbenaceae) at two developmental stages, Biochem. Syst. Ecol., 2007, 35, 12, 831-837, https://doi.org/10.1016/j.bse.2007.07.001 . [all data]

Ferhat, Meklati, et al., 2007
Ferhat, M.A.; Meklati, B.Y.; Chemat, F., Comparison of different isolation methods of essential oil from Citrus fruits: cold pressing, hydrodistillation and microwave dry distillation, Flavour Fragr. J., 2007, 22, 6, 494-504, https://doi.org/10.1002/ffj.1829 . [all data]

Ristic, Krivokuca-Dokic, et al., 2007
Ristic, M.; Krivokuca-Dokic, D.; Radanovic, D.; Nastovski, T., Etarsko ulje Arnica montata i Arnica chamissonis, Hem. Ind., 2007, 61, 5, 272-277, https://doi.org/10.2298/HEMIND0704272R . [all data]

Orav, Raal, et al., 2006
Orav, A.; Raal, A.; Arak, E.; Müürisepp, M.; Kailas, T., Composition of the essential oil of Artemisia absinthium L. of different geographical origin, Proc. Est. Acad. Sci. Chem., 2006, 55, 3, 155-165. [all data]

Kalvandi, Sefidkon, et al., 2004
Kalvandi, R.; Sefidkon, F.; Atri, M.; Mirza, M., Analysis of the essential oil of Thymus eriocalyx from Iran, Flavour Fragr. J., 2004, 19, 4, 341-343, https://doi.org/10.1002/ffj.1312 . [all data]

Palá-Paúl, Pérez-Alonso, et al., 2002
Palá-Paúl, J.; Pérez-Alonso, M.J.; Velasco-Negueruela, A.; Sanz, J., Analysis by gas chromatography-mass spectrometry of the volatile components of Ageratina adenophora Spreng., growing in the Canary Islands, J. Chromatogr. A, 2002, 947, 2, 327-331, https://doi.org/10.1016/S0021-9673(02)00016-X . [all data]

Gupta, Mallavarapu, et al., 2001
Gupta, R.; Mallavarapu, G.R.; Banerjee, S.; Kumar, S., Characteristics of an isomenthone-rich somaclonal mutant isolated in a geraniol-rich rose-scented geranium accession of Pelargonium graveolens, Flavour Fragr. J., 2001, 16, 5, 319-324, https://doi.org/10.1002/ffj.1002 . [all data]

Rajeswara, Kaul, et al., 1996
Rajeswara, B.R.; Kaul, P.N.; Bhattacharya, A.K.; Mallavarapu, G.R.; Ramesh, S., Yield and chemical composition of the essential oils of three Cymbopogon species suffering from iron chlorosis, Flavour Fragr. J., 1996, 11, 5, 289-293, https://doi.org/10.1002/(SICI)1099-1026(199609)11:5<289::AID-FFJ590>3.0.CO;2-7 . [all data]

Nance and Setzer, 2011
Nance, M.R.; Setzer, W.N., Volatile components of aroma hops (Humulus lupulus L.) commonly used in beer brewing, J. of Brewing and Distilling, 2011, 2, 2, 16-22. [all data]

Delort and Jaquier, 2009
Delort, E.; Jaquier, A., Novel terpenyl esters from Australian finger lime (Citrus australasica) peel extract, Flav. Fragr. J., 2009, 24, 3, 123-132, https://doi.org/10.1002/ffj.1922 . [all data]

Miguel, Simões, et al., 2004
Miguel, G.; Simões, M.; Figueiredo, A.C.; Barroso, J.G.; Pedro, L.G.; Carvalho, L., Composition and antioxidant activities of the essential oils of Thymus caespititius, Thymus camphoratus and Thymus mastichina, Food Chem., 2004, 86, 2, 183-188, https://doi.org/10.1016/j.foodchem.2003.08.031 . [all data]

Vinogradov, 2004
Vinogradov, B.A., Production, composition, properties and application of essential oils, 2004, retrieved from http://viness.narod.ru. [all data]

Weyerstahl, Marschall, et al., 1999
Weyerstahl, P.; Marschall, H.; Eckhardt. A.; Christiansen, C., Constituents of commercial Brazilian Iantana oil, Flavour Fragr. J., 1999, 14, 1, 15-28, https://doi.org/10.1002/(SICI)1099-1026(199901/02)14:1<15::AID-FFJ777>3.0.CO;2-M . [all data]

Vernin, 1993
Vernin, G., Mass spectra and Kovats indices of some phenylpropanoic acid esters found in the essential oil of Cistus ladaniferus L., J. Essent. Oil Res., 1993, 5, 5, 563-569, https://doi.org/10.1080/10412905.1993.9698280 . [all data]

Lan Phi N.T., Nishiyama C., et al., 2006
Lan Phi N.T.; Nishiyama C.; Choi H.-S.; Sawamura M., Evaluation of aroma characteristic compounds of Citrus natsudaidai Hayata (Natsudaidai) cold-pressed peel oil, Biosci. Biotechnol. Biochem., 2006, 70, 8, 1832-1838, https://doi.org/10.1271/bbb.50705 . [all data]

Babu and Kaul, 2005
Babu, K.G.D.; Kaul, V.K., Variation in essential oil composition of rose-scented geranium (Pelargonium sp.) distilled by different distillation techniques, Flavour Fragr. J., 2005, 20, 2, 222-231, https://doi.org/10.1002/ffj.1414 . [all data]

Njoroge, Koaze, et al., 2005, 2
Njoroge, S.M.; Koaze, H.; Mwaniki, M.; Minh Tu, N.T.; Sawamura, M., Essential oils of Kenyan Citrus fruits: volatile components of two varieties of mandarins (Citrus reticulata) and a tangelo (C. paradisi × C. tangerina), Flavour Fragr. J., 2005, 20, 1, 74-79, https://doi.org/10.1002/ffj.1376 . [all data]

Choi, 2004
Choi, H.-S., Volatile constituents of satsuma mandarins growing in Korea, Flavour Fragr. J., 2004, 19, 5, 406-412, https://doi.org/10.1002/ffj.1283 . [all data]

Choi, 2004, 2
Choi, H.-S., Aroma evaluation of an aquatic herb, changpo (Acorus calamus Var. angustatus Bess), by AEDA and SPME, J. Agric. Food Chem., 2004, 52, 26, 8099-8104, https://doi.org/10.1021/jf040239p . [all data]

Sawamura, Son, et al., 2004
Sawamura, M.; Son, U.-S.; Choi, H.-S.; Kim, M.-S.L.; Phi, N.T.L.; Fears, M.; Kumagai, Compositional changes in commercial lemon essential oil for aromatherapy, Int. J. Aromatherapy, 2004, 14, 1, 27-36, https://doi.org/10.1016/j.ijat.2004.02.001 . [all data]

Sawamura, Sou, et al., 2004
Sawamura, M.; Sou, U.-S.; Choi, H.-S.; Kim, M.-S.; Phi, N.T.L.; Fears, M.; Kumagai. C., Composition changes in commercial lemon essential oil for aromatherapy, Int. J. Aromatherapy, 2004, 14, 1, 27-36, https://doi.org/10.1016/j.ijat.2004.02.001 . [all data]