2'-Deoxyribolactone, 2TMS derivative

Kovats' RI, non-polar column, isothermal

View large format table.

Column type Active phase Temperature (C) I Reference Comment
CapillarySE-54160.1660.Niemelä, 1996H2; Column length: 25. m; Column diameter: 0.32 mm

References

Niemelä, 1996
Niemelä, K., The formation of novel saccharinic acids, 2-C-(2-hydroxyethyl)tetronic acids, by alkaline degradation of leucrose, Carbohyd. Res., 1996, 285, 41-48, https://doi.org/10.1016/S0008-6215(96)90166-4 . [all data]