Trifluoromethylisocyanide

Gas phase thermochemistry data

Data compiled by: Hussein Y. Afeefy, Joel F. Liebman, and Stephen E. Stein

Quantity Value Units Method Reference Comment
Δfgas-99.7 ± 7.0kcal/molKinHeni and Illenberger, 1986

References

Heni and Illenberger, 1986
Heni, M.; Illenberger, E., The isomers CF3NC and CF3CN. Formation and dissociation of the anions formed on electron attachment, Int. J. Mass Spectrom. Ion Phys., 1986, 71, 199-210. [all data]