Geranyl formate

Phase change data

Data compiled as indicated in comments:
AC - William E. Acree, Jr., James S. Chickos

Enthalpy of vaporization

ΔvapH (kJ/mol) Temperature (K) Method Reference Comment
57.1349.AStephenson and Malanowski, 1987Based on data from 334. - 503. K. See also Stull, 1947.; AC

Antoine Equation Parameters

log10(P) = A − (B / (T + C))
    P = vapor pressure (bar)
    T = temperature (K)

View plot Requires a JavaScript / HTML 5 canvas capable browser.

Temperature (K) A B C Reference Comment
334.9 - 503.5.024352315.053-41.917Stull, 1947Coefficents calculated by NIST from author's data.

Kovats' RI, polar column, isothermal

Data compiled by: NIST Mass Spectrometry Data Center, William E. Wallace, director

Column type CapillaryPacked
Active phase Carbowax 20MCarbowax 20M
Column length (m)  2.5
Carrier gas  N2
Substrate  Embacel
Column diameter (mm)
Phase thickness (μm) 0.45
Temperature (C) 150.150.
I 1727.1717.
ReferenceTudor, Moldovan, et al., 1999ter Heide, 1968
Comment MSDC-RI MSDC-RI

Van Den Dool and Kratz RI, non-polar column, custom temperature program

Data compiled by: NIST Mass Spectrometry Data Center, William E. Wallace, director

Column type Capillary
Active phase 5 % Phenyl methyl siloxane
Column length (m) 30.
Carrier gas He
Substrate
Column diameter (mm) 0.32
Phase thickness (μm) 0.15
Program 45C => 1C/min => 100C => 5C/min => 250C (10min)
I 1298.
ReferenceSacchetti, Maietti, et al., 2005
Comment MSDC-RI

References

Stephenson and Malanowski, 1987
Stephenson, Richard M.; Malanowski, Stanislaw, Handbook of the Thermodynamics of Organic Compounds, 1987, https://doi.org/10.1007/978-94-009-3173-2 . [all data]

Stull, 1947
Stull, Daniel R., Vapor Pressure of Pure Substances. Organic and Inorganic Compounds, Ind. Eng. Chem., 1947, 39, 4, 517-540, https://doi.org/10.1021/ie50448a022 . [all data]