6-Octen-1-ol, 3,7-dimethyl-, formate

Normal alkane RI, non-polar column, custom temperature program

Data compiled by: NIST Mass Spectrometry Data Center, William E. Wallace, director

Column type CapillaryCapillaryCapillary
Active phase SE-30DB-1OV-101
Column length (m)  60.
Carrier gas  He
Substrate
Column diameter (mm)  0.32
Phase thickness (μm)  0.25
Program not specifiednot specifiednot specified
I 1261.1261.1261.
ReferenceVinogradov, 2004Nishimura, 1995Shibamoto, 1987
Comment MSDC-RI MSDC-RI MSDC-RI

Kovats' RI, polar column, isothermal

Data compiled by: NIST Mass Spectrometry Data Center, William E. Wallace, director

Column type CapillaryPacked
Active phase Carbowax 20MCarbowax 20M
Column length (m)  2.5
Carrier gas  N2
Substrate  Embacel
Column diameter (mm)
Phase thickness (μm) 0.45
Temperature (C) 150.150.
I 1644.1638.
ReferenceTudor, Moldovan, et al., 1999ter Heide, 1968
Comment MSDC-RI MSDC-RI

References

Vinogradov, 2004
Vinogradov, B.A., Production, composition, properties and application of essential oils, 2004, retrieved from http://viness.narod.ru. [all data]

Nishimura, 1995
Nishimura, O., Application of a thermal desorption cold trap injector to multidimensional GC and GC-MS, J. Hi. Res. Chromatogr., 1995, 18, 11, 699-704, https://doi.org/10.1002/jhrc.1240181105 . [all data]

Shibamoto, 1987
Shibamoto, T., Retention Indices in Essential Oil Analysis in Capillary Gas Chromatography in Essential Oil Analysis, Sandra, P.; Bicchi, C., ed(s)., Hutchig Verlag, Heidelberg, New York, 1987, 259-274. [all data]