vanadium dichloride

Gas phase ion energetics data

Data compiled by: John E. Bartmess

Electron affinity determinations

EA (eV) Method Reference Comment
1.20 ± 0.20EIAEFlesch and Svec, 1975From VOCl3

References

Flesch and Svec, 1975
Flesch, G.D.; Svec, H.J., Thermochemistry of vanadium oxytrichloride and vanadium oxytrifluoride by mass spectrometry, Inorg. Chem., 1975, 14, 1817. [all data]