Hexanoic acid, 2-methylpropyl ester

Van Den Dool and Kratz RI, non-polar column, temperature ramp

Data compiled by: NIST Mass Spectrometry Data Center, William E. Wallace, director

Column type CapillaryCapillaryCapillaryCapillaryCapillary
Active phase CP Sil 5 CBCP Sil 5 CBSPB-1CP Sil 5 CBDB-5
Column length (m) 50.50.30.50.30.
Carrier gas H2HeHeHeH2
Substrate
Column diameter (mm) 0.250.320.320.320.32
Phase thickness (μm) 0.150.44.0.41.
Tstart (C) 40.60.45.60.40.
Tend (C) 300.280.240.280.210.
Heat rate (K/min) 4.3.5.3.3.
Initial hold (min) 3.10.13.10.
Final hold (min)  60.5.60.
I 1152.1140.1136.1137.1149.
ReferenceHeinrich, Pfeifhofer, et al., 2002Pino, Marbot, et al., 2002Larráyoz, Addis, et al., 2001Pino, Marbot, et al., 2001Moio, Piombino, et al., 2000
Comment MSDC-RI MSDC-RI MSDC-RI MSDC-RI MSDC-RI
Column type CapillaryCapillary
Active phase DB-5DB-5
Column length (m) 30.30.
Carrier gas H2H2
Substrate
Column diameter (mm) 0.320.32
Phase thickness (μm) 1.1.
Tstart (C) 40.40.
Tend (C) 210.210.
Heat rate (K/min) 3.3.
Initial hold (min)
Final hold (min)
I 1149.1149.
ReferenceMoio, Piombino, et al., 2000Moio and Addeo, 1998
Comment MSDC-RI MSDC-RI

Kovats' RI, non-polar column, isothermal

View large format table.

Column type Active phase Temperature (C) I Reference Comment
PackedSE-30100.1135.Chastrette, Heintz, et al., 1974N2, Chromosorb W AW (60-80 mesh); Column length: 3. m
PackedSE-30150.1131.Germaine and Haken, 1969Celite 560; Column length: 3.7 m

Kovats' RI, non-polar column, temperature ramp

View large format table.

Column type Active phase I Reference Comment
CapillaryCP Sil 5 CB1144.Kaul and Vats, 19985. K/min; Column length: 25. m; Column diameter: 0.25 mm; Tstart: 60. C; Tend: 280. C
CapillaryCP Sil 5 CB1133.Kaul and Vats, 19985. K/min; Column length: 25. m; Column diameter: 0.25 mm; Tstart: 60. C; Tend: 280. C
CapillaryDB-11138.Takeoka, Buttery, et al., 199260. m/0.32 mm/0.25 μm, He, 30. C @ 4. min, 2. K/min; Tend: 210. C
CapillaryDB-11138.Takeoka, Buttery, et al., 199260. m/0.32 mm/0.25 μm, He, 30. C @ 4. min, 2. K/min; Tend: 210. C
CapillaryDB-11138.Takeoka, Flath, et al., 199060. m/0.32 mm/0.25 μm, He, 30. C @ 4. min, 2. K/min; Tend: 210. C
CapillaryDB-11139.Takeoka, Flath, et al., 199060. m/0.32 mm/0.25 μm, He, 30. C @ 4. min, 2. K/min; Tend: 210. C

Kovats' RI, polar column, isothermal

View large format table.

Column type Active phase Temperature (C) I Reference Comment
PackedCarbowax 20M100.1347.Chastrette, Heintz, et al., 1974Chromosorb WAW (60-80 mesh); Column length: 3. m

Kovats' RI, polar column, temperature ramp

View large format table.

Column type Active phase I Reference Comment
CapillaryDB-Wax1351.Umano, Shoji, et al., 1986N2, 60. C @ 10. min, 2. K/min; Column length: 30. m; Column diameter: 0.25 mm; Tend: 200. C
CapillaryCarbowax 20M1347.Tressl, Friese, et al., 1978He, 2. K/min; Column length: 50. m; Column diameter: 0.28 mm; Tstart: 70. C; Tend: 190. C

Van Den Dool and Kratz RI, non-polar column, custom temperature program

View large format table.

Column type Active phase I Reference Comment
CapillaryVF-5MS1144.Carasek and Pawliszyn, 200630. m/0.25 mm/0.25 μm, He; Program: 40C(2min) => 5C/min => 200C (2min) => 30C/min => 260C
CapillaryVF-5MS1144.Carasek and Pawliszyn, 200630. m/0.25 mm/0.25 μm, He; Program: 40C(2min) => 5C/min => 200C (2min) => 30C/min => 260C

Van Den Dool and Kratz RI, polar column, temperature ramp

View large format table.

Column type Active phase I Reference Comment
CapillaryCP-Wax 52CB1356.Kourkoutas, Elmore, et al., 200660. m/0.25 mm/0.25 μm, He, 4. K/min; Tstart: 40. C; Tend: 250. C
CapillaryZB-Wax1347.Ledauphin, Saint-Clair, et al., 200430. m/0.25 mm/0.15 μm, He, 35. C @ 5. min, 5. K/min, 220. C @ 10. min
CapillaryAT-Wax1343.Pino, Marbot, et al., 200260. m/0.32 mm/0.25 μm, He, 65. C @ 10. min, 2. K/min, 250. C @ 60. min
CapillaryAT-Wax1346.Pino, Marbot, et al., 200160. m/0.32 mm/0.25 μm, He, 65. C @ 10. min, 2. K/min, 250. C @ 60. min
CapillaryDB-Wax1347.Cha, Kim, et al., 199860. m/0.25 mm/0.25 μm, 40. C @ 5. min, 3. K/min, 200. C @ 60. min

Normal alkane RI, non-polar column, temperature ramp

View large format table.

Column type Active phase I Reference Comment
CapillaryHP-5 MS1153.Pino, Marquez, et al., 201030. m/0.32 mm/0.25 μm, Helium, 50. C @ 2. min, 4. K/min, 240. C @ 10. min
CapillaryHP-5 MS1148.Forero, Quijano, et al., 200830. m/0.25 mm/0.25 μm, Helium, 50. C @ 4. min, 4. K/min, 230. C @ 10. min
CapillaryDB-11133.Kumazawa, Itobe, et al., 200830. m/0.25 mm/0.25 μm, He, 5. K/min; Tstart: 30. C; Tend: 210. C
CapillaryDB-51150.Fan and Qian, 200630. m/0.32 mm/1. μm, He, 40. C @ 2. min, 4. K/min, 250. C @ 15. min
CapillaryDB-51154.Fan and Qian, 2006, 230. m/0.32 mm/1. μm, N2, 40. C @ 2. min, 6. K/min, 230. C @ 15. min
CapillaryDB-51150.Fan and Qian, 200530. m/0.32 mm/0.25 μm, N2, 40. C @ 2. min, 4. K/min, 250. C @ 5. min
CapillaryOV-1011140.Camciuc, Bessière, et al., 199850. m/0.22 mm/1. μm, He, 100. C @ 1. min, 1. K/min; Tend: 220. C
CapillaryOV-11140.Schreyen, Dirinck, et al., 1979N2, 1. K/min; Column length: 183. m; Column diameter: 0.762 mm; Tstart: 0. C; Tend: 230. C

Normal alkane RI, non-polar column, custom temperature program

View large format table.

Column type Active phase I Reference Comment
CapillaryPolydimethyl siloxane with 5 % Ph groups1144.Robinson, Adams, et al., 2012Program: not specified
CapillaryPolydimethyl siloxane with 5 % Ph groups1152.Robinson, Adams, et al., 2012Program: not specified
CapillaryHP-5 MS1156.Pino, Marquez, et al., 201030. m/0.32 mm/0.25 μm, Helium; Program: not specified
CapillaryBPX-51153.Ortiz, Echeverra, et al., 200930. m/0.25 mm/0.25 μm, Helium; Program: 70 0C (1 min) 3 0C/min -> 142 0C 5 0C/min -> 225 0C (10 min)
CapillarySE-301119.Liu, Liang, et al., 2007Program: not specified
CapillarySE-301140.Vinogradov, 2004Program: not specified
CapillaryHP-51143.Jordán, Goodner, et al., 200230. m/0.25 mm/0.25 μm; Program: not specified
CapillaryHP-51148.Jordán, Goodner, et al., 200230. m/0.25 mm/0.25 μm; Program: not specified

Normal alkane RI, polar column, temperature ramp

View large format table.

Column type Active phase I Reference Comment
CapillaryCP-Wax CB1353.Alves, da Penha, et al., 201230. m/0.25 mm/0.25 μm, Helium, 2. K/min, 150. C @ 5. min; Tstart: 50. C
CapillaryDB-Wax1356.Kumazawa, Itobe, et al., 200830. m/0.25 mm/0.25 μm, He, 5. K/min; Tstart: 30. C; Tend: 210. C
CapillaryDB-Wax1373.Fan and Qian, 200630. m/0.32 mm/0.25 μm, He, 40. C @ 2. min, 4. K/min, 230. C @ 15. min
CapillaryDB-Wax1355.Fan and Qian, 2006, 230. m/0.32 mm/0.25 μm, N2, 40. C @ 2. min, 6. K/min, 230. C @ 15. min
CapillaryDB-Wax1353.Jiang and Kubota, 2004He, 60. C @ 4. min, 2. K/min; Column length: 60. m; Column diameter: 0.25 mm; Tend: 220. C
CapillaryDB-Wax1353.Jiang and Kubota, 2004He, 60. C @ 4. min, 2. K/min; Column length: 60. m; Column diameter: 0.25 mm; Tend: 220. C
CapillaryDB-Wax1357.Werkhoff, Güntert, et al., 199860. m/0.32 mm/0.25 μm, H2, 3. K/min; Tstart: 60. C; Tend: 220. C
CapillaryCarbowax 20M1346.Mihara, Tateba, et al., 1988N2, 3. K/min; Column length: 50. m; Column diameter: 0.22 mm; Tstart: 80. C; Tend: 200. C
CapillaryCarbowax 20M1350.Mihara, Tateba, et al., 1988N2, 3. K/min; Column length: 50. m; Column diameter: 0.22 mm; Tstart: 80. C; Tend: 200. C
CapillaryCarbowax 20M1346.Mihara, Tateba, et al., 1987N2, 3. K/min; Column length: 50. m; Column diameter: 0.22 mm; Tstart: 80. C; Tend: 200. C
CapillaryCarbowax 20M1350.Mihara, Tateba, et al., 1987N2, 3. K/min; Column length: 50. m; Column diameter: 0.22 mm; Tstart: 80. C; Tend: 200. C

Normal alkane RI, polar column, custom temperature program

View large format table.

Column type Active phase I Reference Comment
CapillaryFFAP1399.Ortiz, Echeverra, et al., 200950. m/0.20 mm/0.33 μm, Helium; Program: 70 0C (1 min) 3 0C/min -> 142 0C 5 0C/min -> 225 0C (10 min)
CapillaryDB-Wax1348.Rowan, Hunt, et al., 200920. m/0.18 mm/0.18 μm, Helium; Program: 35 0C (1 min) 2/9 0C/min -> 100 0C 8 0C/min -> 200 0C (5 min)
CapillaryCarbowax 20M1350.Vinogradov, 2004Program: not specified

References

Heinrich, Pfeifhofer, et al., 2002
Heinrich, G.; Pfeifhofer, H.W.; Stabentheiner, E.; Sawidis, T., Glandular hairs of Sigesbeckia jorullensis Kunth (Asteraceae): morphology, histochemistry and composition of essential oil, Ann. Bot. Rome, 2002, 89, 4, 459-469, retrieved from http://www.aob.oupjournals.org, https://doi.org/10.1093/aob/mcf062 . [all data]

Pino, Marbot, et al., 2002
Pino, J.A.; Marbot, R.; Vázquez, C., Characterization of volatile in Cosa Rican Guava [Psidium friedrichsthalianum (Berg) Niedenzu] fruit, J. Agric. Food Chem., 2002, 50, 21, 6023-6026, https://doi.org/10.1021/jf011456i . [all data]

Larráyoz, Addis, et al., 2001
Larráyoz, P.; Addis, M.; Gauch, R.; Bosset, J.O., Comparison of dynamic headspace and simultaneous distillation extraction techniques used for the analysis of the volatile components in three European PDO ewes milk cheeses, Int. Dairy J., 2001, 11, 11-12, 911-926, https://doi.org/10.1016/S0958-6946(01)00144-3 . [all data]

Pino, Marbot, et al., 2001
Pino, J.A.; Marbot, R.; Vázquez, C., Characterization of volatiles in strawberry guava (Psidium cattleianum Sabine) fruit, J. Agric. Food Chem., 2001, 49, 12, 5883-5887, https://doi.org/10.1021/jf010414r . [all data]

Moio, Piombino, et al., 2000
Moio, L.; Piombino, P.; Addeo, F., Odour-impact compounds of Gorgonzola cheese, J. Dairy Res., 2000, 67, 2, 273-285, https://doi.org/10.1017/S0022029900004106 . [all data]

Moio and Addeo, 1998
Moio, L.; Addeo, F., Grana Padano cheese aroma, J. Dairy Res., 1998, 65, 2, 317-333, https://doi.org/10.1017/S0022029997002768 . [all data]