DL-trans-Decahydroquinoline

Condensed phase thermochemistry data

Data compiled by: Hussein Y. Afeefy, Joel F. Liebman, and Stephen E. Stein

Quantity Value Units Method Reference Comment
Δfliquid-45.60 ± 0.33kcal/molCcbSteele, Chirico, et al., 1990
Quantity Value Units Method Reference Comment
Δcliquid-1381.53 ± 0.29kcal/molCcbSteele, Chirico, et al., 1990

Phase change data

Data compiled by: Hussein Y. Afeefy, Joel F. Liebman, and Stephen E. Stein

Quantity Value Units Method Reference Comment
Δvap12.73kcal/molVSteele, Chirico, et al., 1990

References

Steele, Chirico, et al., 1990
Steele, W.V.; Chirico, R.D.; Nguyen, A.; Knipmeyer, S.E., The thermodynamic properties of 2-methylaniline and trans-(R,S)-decahydroquinoline, Topical Rept., work performed under cooperative agreement No. FC22-83FE60149, Bartlesville,OK, (NIPER-459), 1990, 1-52. [all data]