Caprolactam

Gas phase thermochemistry data

Data compiled by: Hussein Y. Afeefy, Joel F. Liebman, and Stephen E. Stein

Quantity Value Units Method Reference Comment
Δfgas-239.6kJ/molCcbKabo, Kozyro, et al., 1992

Normal alkane RI, non-polar column, custom temperature program

Data compiled by: NIST Mass Spectrometry Data Center, William E. Wallace, director

Column type CapillaryCapillary
Active phase Methyl SiliconeMethyl Silicone
Column length (m)
Carrier gas
Substrate
Column diameter (mm)
Phase thickness (μm)
Program not specifiednot specified
I 1255.1266.
ReferenceSavelieva and Zenkevich I., 2003Savelieva and Zenkevich I., 2003
Comment MSDC-RI MSDC-RI

References

Kabo, Kozyro, et al., 1992
Kabo, G.J.; Kozyro, A.A.; Krouk, V.S.; Sevruk, V.M.; Yursha, I.A.; Simirsky, V.V.; Gogolinsky, V.I., Thermodynamic properties of 6-aminohexanoic lactam (ε-caprolactam), J. Chem. Thermodyn., 1992, 24, 1-3. [all data]