Methyldiethanolamine

Phase change data

Data compiled as indicated in comments:
BS - Robert L. Brown and Stephen E. Stein
AC - William E. Acree, Jr., James S. Chickos

Quantity Value Units Method Reference Comment
Tboil520.2KN/AWeast and Grasselli, 1989BS

Enthalpy of vaporization

ΔvapH (kcal/mol) Temperature (K) Method Reference Comment
17.1422.EBKim, Svendsen, et al., 2008Based on data from 409. - 435. K.; AC
17.4405.AStephenson and Malanowski, 1987Based on data from 390. - 520. K.; AC

References

Weast and Grasselli, 1989
CRC Handbook of Data on Organic Compounds, 2nd Editon, Weast,R.C and Grasselli, J.G., ed(s)., CRC Press, Inc., Boca Raton, FL, 1989, 1. [all data]

Kim, Svendsen, et al., 2008
Kim, Inna; Svendsen, Hallvard F.; Børresen, Eli, Ebulliometric Determination of Vapor-Liquid Equilibria for Pure Water, Monoethanolamine, N -Methyldiethanolamine, 3-(Methylamino)-propylamine, and Their Binary and Ternary Solutions, J. Chem. Eng. Data, 2008, 53, 11, 2521-2531, https://doi.org/10.1021/je800290k . [all data]

Stephenson and Malanowski, 1987
Stephenson, Richard M.; Malanowski, Stanislaw, Handbook of the Thermodynamics of Organic Compounds, 1987, https://doi.org/10.1007/978-94-009-3173-2 . [all data]