Ethyl 2-butenoate

Van Den Dool and Kratz RI, polar column, custom temperature program

Data compiled by: NIST Mass Spectrometry Data Center, William E. Wallace, director

Column type CapillaryCapillary
Active phase DB-WaxStabilwax
Column length (m) 60.30.
Carrier gas HeHe
Substrate
Column diameter (mm) 0.250.32
Phase thickness (μm) 0.251.
Program 35C(0.7min) => 20C/min => 70C => 4C/min => 240C40C (2min) => 5C/min => 100C => 4C/min => 230C (10min)
I 1153.1165.
ReferenceFerrari, Lablanquie, et al., 2004Klesk, Qian, et al., 2004
Comment MSDC-RI MSDC-RI

Normal alkane RI, non-polar column, temperature ramp

Data compiled by: NIST Mass Spectrometry Data Center, William E. Wallace, director

Column type Capillary
Active phase HP-5
Column length (m) 30.
Carrier gas H2
Substrate
Column diameter (mm) 0.25
Phase thickness (μm) 0.25
Tstart (C) 40.
Tend (C) 280.
Heat rate (K/min) 3.
Initial hold (min) 10.
Final hold (min) 10.
I 863.
ReferenceBicalho, Pereira, et al., 2000
Comment MSDC-RI

Phase change data

Data compiled by: William E. Acree, Jr., James S. Chickos

Enthalpy of vaporization

ΔvapH (kJ/mol) Temperature (K) Method Reference Comment
47.1344.AStephenson and Malanowski, 1987Based on data from 329. - 420. K.

Normal alkane RI, polar column, temperature ramp

Data compiled by: NIST Mass Spectrometry Data Center, William E. Wallace, director

Column type CapillaryCapillaryCapillaryCapillaryCapillary
Active phase DB-WaxDB-WaxDB-WaxSupelcowax-10HP-Innowax
Column length (m) 30.60.60.10.30.
Carrier gas HeliumHeliumHeliumHeHe
Substrate
Column diameter (mm) 0.250.320.320.10.25
Phase thickness (μm) 0.250.250.250.10.5
Tstart (C) 40.30.30.40.40.
Tend (C) 230.200.200.240.200.
Heat rate (K/min) 3.2.2.50.2.
Initial hold (min) 2.4.4.1.53.
Final hold (min) 5.30.30.2.15.
I 1153.1158.1158.1150.1146.
ReferenceZhao, Xu, et al., 2009Beck, Higbee, et al., 2008Beck, Higbee, et al., 2008Chin, Nazimah, et al., 2007Komes, Ulrich, et al., 2006
Comment MSDC-RI MSDC-RI MSDC-RI MSDC-RI MSDC-RI
Column type CapillaryCapillaryCapillaryCapillary
Active phase CP-Wax 52CBDB-WaxDB-WaxCP-Wax 52CB
Column length (m) 50.30.30.50.
Carrier gas H2HeHeH2
Substrate
Column diameter (mm) 0.320.250.250.32
Phase thickness (μm) 0.220.250.250.22
Tstart (C) 60.20.50.50.
Tend (C) 190.200.200.200.
Heat rate (K/min) 2.4.4.2.
Initial hold (min) 4.4.4.5.
Final hold (min) 21.10.10.
I 1122.1148.1161.1179.9
ReferenceHwan and Chou, 1999Morales, Albarracín, et al., 1996Morales, Albarracín, et al., 1996Chyau, Chen, et al., 1992
Comment MSDC-RI MSDC-RI MSDC-RI MSDC-RI

References

Ferrari, Lablanquie, et al., 2004
Ferrari, G.; Lablanquie, O.; Cantagrel, R.; Ledauphin, J.; Payot, T.; Fournier, N.; Guichard, E., Determination of key odorant compounds in freshly distilled cognac using GC-O, GC-MS, and sensory evaluation, J. Agric. Food Chem., 2004, 52, 18, 5670-5676, https://doi.org/10.1021/jf049512d . [all data]

Klesk, Qian, et al., 2004
Klesk, K.; Qian, M.; Martin, R.R., Aroma extract dilution analysis of cv. meeker (Rubus idaeus L.) red raspberries from Oregon and Washington, J. Agric. Food Chem., 2004, 52, 16, 5155-5161, https://doi.org/10.1021/jf0498721 . [all data]