Bis(pentafluorophenyl)dimethylsilane

Phase change data

Data compiled as indicated in comments:
BS - Robert L. Brown and Stephen E. Stein
AC - William E. Acree, Jr., James S. Chickos

Quantity Value Units Method Reference Comment
Tboil411. - 413.KN/APCR Inc., 1990BS

Enthalpy of vaporization

ΔvapH (kJ/mol) Temperature (K) Reference Comment
55.3 ± 0.6414.Zelenina, Chusova, et al., 2006Based on data from 366. - 463. K.; AC

References

PCR Inc., 1990
PCR Inc., Research Chemicals Catalog 1990-1991, PCR Inc., Gainesville, FL, 1990, 1. [all data]

Zelenina, Chusova, et al., 2006
Zelenina, L.N.; Chusova, T.P.; Stenin, Yu.G.; Bakovets, V.V., The thermodynamic properties of talyl-and phenylsilanes, Russ. J. Phys. Chem., 2006, 80, 2, 139-142, https://doi.org/10.1134/S0036024406020014 . [all data]