Acetic acid, bromo-, ethyl ester

Kovats' RI, non-polar column, isothermal

Data compiled by: NIST Mass Spectrometry Data Center, William E. Wallace, director

Column type PackedCapillary
Active phase SE-30OV-101
Column length (m) 3.15.
Carrier gas ArN2
Substrate Gas Chrom Q (80-100 mesh)
Column diameter (mm)  0.22
Phase thickness (μm)
Temperature (C) 150.80.
I 880.873.4
ReferenceTiess, 1984Komárek, Hornová, et al., 1982
Comment MSDC-RI MSDC-RI

References

Tiess, 1984
Tiess, D., Gaschromatographische Retentionsindices von 125 leicht- bis mittelflüchtigen organischen Substanzen toxikologisch-analytischer Relevanz auf SE-30, Wiss. Z. Wilhelm-Pieck-Univ. Rostock Math. Naturwiss. Reihe, 1984, 33, 6-9. [all data]

Komárek, Hornová, et al., 1982
Komárek, K.; Hornová, L.; Churácek, J., Glass capillary gas chromatography of homologous series of esters. Separation of homologous series of esters of halogenated carboxylic acids on a glass capillary column with the non-polar stationary silicone phase OV-101, J. Chromatogr., 1982, 244, 1, 142-147, https://doi.org/10.1016/S0021-9673(00)80131-4 . [all data]