Benzenemethanol, 4-methoxy-

Normal alkane RI, non-polar column, custom temperature program

Data compiled by: NIST Mass Spectrometry Data Center, William E. Wallace, director

Column type CapillaryCapillaryCapillaryCapillaryCapillary
Active phase HP-5MSSE-30HP-5DB-5OV-101
Column length (m) 30. 50.30.
Carrier gas He He
Substrate
Column diameter (mm) 0.25 0.320.20
Phase thickness (μm) 0.25 1.051.0
Program 40C(3min) => 2C/min => 180C => 10C/min => 250C(5min)not specifiednot specifiednot specifiednot specified
I 1290.1267.1295.01275.1267.
ReferenceAlissandrakis, Kibaris, et al., 2005Vinogradov, 2004David, Scanlan, et al., 2002Rapior, Breheret, et al., 2002Shibamoto, 1987
Comment MSDC-RI MSDC-RI MSDC-RI MSDC-RI MSDC-RI

Phase change data

Data compiled as indicated in comments:
BS - Robert L. Brown and Stephen E. Stein
TRC - Thermodynamics Research Center, NIST Boulder Laboratories, Chris Muzny director
AC - William E. Acree, Jr., James S. Chickos

Quantity Value Units Method Reference Comment
Tboil532.3KN/AWeast and Grasselli, 1989BS
Tboil489.15KN/APerkin, 1896Uncertainty assigned by TRC = 2. K; TRC
Quantity Value Units Method Reference Comment
Tfus290.15KN/APerkin, 1896Uncertainty assigned by TRC = 1.5 K; TRC

Enthalpy of vaporization

ΔvapH (kJ/mol) Temperature (K) Method Reference Comment
95.6409.AStephenson and Malanowski, 1987Based on data from 394. - 424. K.; AC
71.7369.EBScholz and Brunner, 1985Based on data from 354. - 453. K.; AC

In addition to the Thermodynamics Research Center (TRC) data available from this site, much more physical and chemical property data is available from the following TRC products:

References

Alissandrakis, Kibaris, et al., 2005
Alissandrakis, E.; Kibaris, A.C.; Tarantilis, P.A.; Harizanis, P.C.; Polissiou, M., Flavour compounds of Greek cotton honey, J. Sci. Food Agric., 2005, 85, 9, 1444-1452, https://doi.org/10.1002/jsfa.2124 . [all data]

Vinogradov, 2004
Vinogradov, B.A., Production, composition, properties and application of essential oils, 2004, retrieved from http://viness.narod.ru. [all data]

David, Scanlan, et al., 2002
David, F.; Scanlan, F.; Sandra, P.; Szelewski, M., Analysis of essential oil compounds using retention time locked methods and retention time databases, 2002, retrieved from http://www.chem.agilent.com. [all data]

Rapior, Breheret, et al., 2002
Rapior, S.; Breheret, S.; Talou T.; Pelissier, Y.; Bessiere, J.-M., The anise-like odor of Clitocybe odora, Lentinellus cochleatus and Agaricus essettei, Mycologia, 2002, 94, 3, 373-376, https://doi.org/10.2307/3761770 . [all data]

Shibamoto, 1987
Shibamoto, T., Retention Indices in Essential Oil Analysis in Capillary Gas Chromatography in Essential Oil Analysis, Sandra, P.; Bicchi, C., ed(s)., Hutchig Verlag, Heidelberg, New York, 1987, 259-274. [all data]