Furan, 2,3,5-trimethyl-

Normal alkane RI, polar column, temperature ramp

Data compiled by: NIST Mass Spectrometry Data Center, William E. Wallace, director

Column type CapillaryCapillaryCapillary
Active phase FFAPHP-WaxHP-Wax
Column length (m) 30.60.60.
Carrier gas N2HeHe
Substrate
Column diameter (mm) 0.320.250.25
Phase thickness (μm) 0.50.50.5
Tstart (C) 35.40.40.
Tend (C) 320.190.190.
Heat rate (K/min) 4.3.3.
Initial hold (min) 5.6.6.
Final hold (min) 45.
I 1065.1056.1056.
ReferenceNebesny, Budryn, et al., 2007Sanz, Maeztu, et al., 2002Sanz, Ansorena, et al., 2001
Comment MSDC-RI MSDC-RI MSDC-RI

References

Nebesny, Budryn, et al., 2007
Nebesny, E.; Budryn, G.; Kula, J.; Majda, T., The effect of roasting method on headspace composition of robusta coffee bean aroma, Eur. Food Res. Technol., 2007, 225, 1, 9-19, https://doi.org/10.1007/s00217-006-0375-0 . [all data]

Sanz, Maeztu, et al., 2002
Sanz, C.; Maeztu, L.; Zapelena, M.J.; Bello, J.; Cid, C., Profiles of volatile compounds and sensory analysis of three blends of coffee: influence of different proportions of Arabica and Robusta and influence of roasting coffee with sugar, J. Sci. Food Agric., 2002, 82, 8, 840-847, https://doi.org/10.1002/jsfa.1110 . [all data]

Sanz, Ansorena, et al., 2001
Sanz, C.; Ansorena, D.; Bello, J.; Cid, C., Optimizing headspace temperature and time sampling for identification of volatile compounds in ground roasted Arabica coffee, J. Agric. Food Chem., 2001, 49, 3, 1364-1369, https://doi.org/10.1021/jf001100r . [all data]