2-Cyclopenten-1-one, 2-hydroxy-

Normal alkane RI, non-polar column, temperature ramp

Data compiled by: NIST Mass Spectrometry Data Center, William E. Wallace, director

Column type CapillaryCapillaryCapillary
Active phase HP-5ZB-5HP-1
Column length (m) 60.30.50.
Carrier gas HeliumHelium
Substrate
Column diameter (mm) 0.250.250.2
Phase thickness (μm) 0.250.250.33
Tstart (C) 35.40.60.
Tend (C) 220.280.250.
Heat rate (K/min) 10.6.2.
Initial hold (min) 1.1.
Final hold (min) 15.9.10.
I 927.926.905.
ReferencePiyachaiseth, Jirapakkul, et al., 2011Harrison and Priest, 2009Antoniotti, Alezra, et al., 2004
Comment MSDC-RI MSDC-RI MSDC-RI

Normal alkane RI, polar column, custom temperature program

Data compiled by: NIST Mass Spectrometry Data Center, William E. Wallace, director

Column type Capillary
Active phase Innowax
Column length (m)
Carrier gas
Substrate
Column diameter (mm)
Phase thickness (μm)
Program not specified
I 1769.
ReferenceAntoniotti, Alezra, et al., 2004
Comment MSDC-RI

Van Den Dool and Kratz RI, non-polar column, temperature ramp

Data compiled by: NIST Mass Spectrometry Data Center, William E. Wallace, director

Column type Capillary
Active phase OV-101
Column length (m) 50.
Carrier gas N2
Substrate
Column diameter (mm) 0.22
Phase thickness (μm)
Tstart (C) 80.
Tend (C) 200.
Heat rate (K/min) 2.
Initial hold (min)
Final hold (min)
I 919.
ReferenceMihara and Nishimura, 1989
Comment MSDC-RI

References

Piyachaiseth, Jirapakkul, et al., 2011
Piyachaiseth, T.; Jirapakkul, W.; Chaiseri, S., Aroma compounds of flash-fried rice, Kasetsart J. (Nat. Sci.), 2011, 45, 717-729. [all data]

Harrison and Priest, 2009
Harrison, B.M.; Priest, F.G., Composition of peaks used in the preparation of malt for Scotch Whisky production - influence of geographical source and extraction depth, J. Agric. Food Chem., 2009, 57, 6, 2385-2391, https://doi.org/10.1021/jf803556y . [all data]

Antoniotti, Alezra, et al., 2004
Antoniotti, S.; Alezra, N.; Fernandez, X.; Duñach, E., Catalytic epoxide oxidation: a novel access to flavouring and odorant α-diketones, Flavour Fragr. J., 2004, 19, 5, 373-381, https://doi.org/10.1002/ffj.1371 . [all data]