Benzaldehyde, 4-methyl-

Normal alkane RI, non-polar column, custom temperature program

Data compiled by: NIST Mass Spectrometry Data Center, William E. Wallace, director

Column type CapillaryCapillaryCapillaryCapillaryCapillary
Active phase TR-5 MSPolydimethyl siloxane with 5 % Ph groupsPolydimethyl siloxane with 5 % Ph groupsSiloxane, 5 % PhPolydimethyl siloxane, 5 % phenyl
Column length (m) 15.
Carrier gas Helium
Substrate
Column diameter (mm) 0.25
Phase thickness (μm) 0.25
Program 35 0C (3 min) 2 0C/min -> 60 0C (3 min) 2 0C/min -> 80 0C (3 min) 4 0C/min -> 120 0C (3 min) 5 0C/min -> 150 0C (3 mion) 15 0C/min -> 240 0C (10 min)not specifiednot specifiednot specifiednot specified
I 1074.1079.1080.1075.1075.
ReferenceKurashov, Krylova, et al., 2013Robinson, Adams, et al., 2012Robinson, Adams, et al., 2012VOC BinBase, 2012Skogerson, Wohlgemuth, et al., 2011
Comment MSDC-RI MSDC-RI MSDC-RI MSDC-RI MSDC-RI
Column type CapillaryCapillaryCapillaryCapillary
Active phase OV-101HP-5MSPolydimethyl siloxane with 5 % Ph groupsSE-30
Column length (m)  30.
Carrier gas  He
Substrate
Column diameter (mm)  0.25
Phase thickness (μm)  0.25
Program not specified40C(3min) => 2C/min => 180C => 10C/min => 250C(5min)not specifiednot specified
I 1067.1081.1079.1067.
ReferenceEbrahimi and Hadjmohammadi, 2006Alissandrakis, Kibaris, et al., 2005Pino, Marbot, et al., 2005Vinogradov, 2004
Comment MSDC-RI MSDC-RI MSDC-RI MSDC-RI

Van Den Dool and Kratz RI, non-polar column, temperature ramp

Data compiled by: NIST Mass Spectrometry Data Center, William E. Wallace, director

Column type CapillaryCapillaryCapillaryCapillaryCapillary
Active phase HP-5MSSPB-5SPB-5SPB-5DB-5
Column length (m) 30.30.30.30.30.
Carrier gas HeHeHeHeHe
Substrate
Column diameter (mm) 0.250.250.250.250.25
Phase thickness (μm) 0.250.250.250.251.
Tstart (C) 60.60.60.60.50.
Tend (C) 250.250.250.250.200.
Heat rate (K/min) 4.4.4.4.2.5
Initial hold (min) 2.2.2.2.
Final hold (min) 20.20.20.20.
I 1079.1079.1079.1079.1076.1
ReferencePino, Mesa, et al., 2005Pino, Marbot, et al., 2004Pino, Marbot, et al., 2004, 2Pino, Marbot, et al., 2003Xu, van Stee, et al., 2003
Comment MSDC-RI MSDC-RI MSDC-RI MSDC-RI MSDC-RI
Column type Capillary
Active phase SPB-5
Column length (m) 30.
Carrier gas He
Substrate
Column diameter (mm) 0.25
Phase thickness (μm) 0.25
Tstart (C) 60.
Tend (C) 250.
Heat rate (K/min) 4.
Initial hold (min) 2.
Final hold (min) 20.
I 1079.
ReferencePino, Marbot, et al., 2002
Comment MSDC-RI

References

Kurashov, Krylova, et al., 2013
Kurashov, E.A.; Krylova, Yu.V.; Mitrukova, G.G., Variations in component composition of essential oil of Potamogeton pusillus (Potamogetonaceae) dirong vegetation, Plant Resources (Rastitel'nye Resursy), 2013, 000-000. [all data]

Robinson, Adams, et al., 2012
Robinson, A.L.; Adams, D.O.; Boss, P.K.; Heymann, H.; Solomon, P.S.; Trengove, R.D., Influence of geographic origine on the sensory characteristics and wine composition of Vitus viniferas cv. Cabernet Sauvignon wines from Australia (Supplemental data), Am. J. Enol. Vitic., 2012, 64, 4, 467-476, https://doi.org/10.5344/ajev.2012.12023 . [all data]

VOC BinBase, 2012
VOC BinBase, The volatile compound BinBase (VOC BinBase), 2012, retrieved from http://fiehnlab.ucdavis.edu/projects/VocBinBase and http://binbase.sourceforge.net. [all data]

Skogerson, Wohlgemuth, et al., 2011
Skogerson, K.; Wohlgemuth, G.; Fiehn, O., VocBinNase, 2011, retrieved from http://fiehnlab.ucdavis.edu/projects//VocBinBase. [all data]

Ebrahimi and Hadjmohammadi, 2006
Ebrahimi, P.; Hadjmohammadi, M.R., Simultaneous modeling of the Kovats retention indices on phenyl OV stationary phases with different polarity using MLR and ANN, QSAR Comb. Sci., 2006, 25, 10, 836-845, https://doi.org/10.1002/qsar.200530145 . [all data]

Alissandrakis, Kibaris, et al., 2005
Alissandrakis, E.; Kibaris, A.C.; Tarantilis, P.A.; Harizanis, P.C.; Polissiou, M., Flavour compounds of Greek cotton honey, J. Sci. Food Agric., 2005, 85, 9, 1444-1452, https://doi.org/10.1002/jsfa.2124 . [all data]

Pino, Marbot, et al., 2005
Pino, J.A.; Marbot, R.; Rosado, A.; Vázquez, C., Volatile constituents of Malay rose apple [Syzygium malaccense (L.) Merr. Perry], Flavour Fragr. J., 2005, 20, 98-100. [all data]

Vinogradov, 2004
Vinogradov, B.A., Production, composition, properties and application of essential oils, 2004, retrieved from http://viness.narod.ru. [all data]