Formic acid, phenylmethyl ester

Van Den Dool and Kratz RI, polar column, temperature ramp

Data compiled by: NIST Mass Spectrometry Data Center, William E. Wallace, director

Column type CapillaryPacked
Active phase Carbowax 20MCarbowax 20M
Column length (m) 50.
Carrier gas He
Substrate  Celite 545
Column diameter (mm) 0.32
Phase thickness (μm)
Tstart (C) 50.75.
Tend (C) 200.228.
Heat rate (K/min) 2.4.6
Initial hold (min) 5.
Final hold (min) 40.
I 1671.1687.
ReferenceChen, Kuo, et al., 1986van den Dool and Kratz, 1963
Comment MSDC-RI MSDC-RI

Van Den Dool and Kratz RI, non-polar column, custom temperature program

Data compiled by: NIST Mass Spectrometry Data Center, William E. Wallace, director

Column type Capillary
Active phase HP-5MS
Column length (m) 30.
Carrier gas He
Substrate
Column diameter (mm) 0.25
Phase thickness (μm) 0.25
Program 60C (1 min) => 5 C/min => 210C => 10 C/min => 280C (15 min)
I 1081.6
ReferenceAndriamaharavo, 2014
Comment MSDC-RI

Phase change data

Data compiled as indicated in comments:
TRC - Thermodynamics Research Center, NIST Boulder Laboratories, Chris Muzny director
BS - Robert L. Brown and Stephen E. Stein
AC - William E. Acree, Jr., James S. Chickos

Quantity Value Units Method Reference Comment
Tboil476.15KN/ALecat, 1943Uncertainty assigned by TRC = 0.4 K; TRC

Reduced pressure boiling point

Tboil (K) Pressure (atm) Reference Comment
357.70.013Weast and Grasselli, 1989BS

Enthalpy of vaporization

ΔvapH (kcal/mol) Temperature (K) Method Reference Comment
12.3313.AStephenson and Malanowski, 1987Based on data from 298. - 357. K.; AC

In addition to the Thermodynamics Research Center (TRC) data available from this site, much more physical and chemical property data is available from the following TRC products:

Van Den Dool and Kratz RI, non-polar column, temperature ramp

View large format table.

Column type Active phase I Reference Comment
CapillaryHP-51081.David, Scanlan, et al., 200050. m/0.32 mm/1.05 μm, He, 2. K/min; Tstart: 50. C; Tend: 290. C
PackedSE-301057.van den Dool and Kratz, 1963Celite; Tstart: 75. C; Tend: 228. C

Van Den Dool and Kratz RI, polar column, custom temperature program

View large format table.

Column type Active phase I Reference Comment
CapillaryCarbowax 20M1705.Whitfield, Shea, et al., 1981Column length: 150. m; Column diameter: 0.75 mm; Program: not specified

Normal alkane RI, non-polar column, temperature ramp

View large format table.

Column type Active phase I Reference Comment
CapillaryHP-11043.Castel, Fernandez, et al., 200650. m/0.2 mm/0.33 μm, He, 60. C @ 4. min, 2. K/min, 250. C @ 30. min
CapillaryHP-11045.Castel, Fernandez, et al., 200650. m/0.2 mm/0.33 μm, He, 60. C @ 4. min, 2. K/min, 250. C @ 30. min
CapillaryHP-11046.Castel, Fernandez, et al., 200650. m/0.2 mm/0.33 μm, He, 60. C @ 4. min, 2. K/min, 250. C @ 30. min
CapillaryHP-11044.Castel, Fernandez, et al., 2006, 250. m/0.2 mm/0.5 μm, He, 2. K/min, 250. C @ 120. min; Tstart: 60. C
CapillaryHP-11044.Castel, Fernandez, et al., 2006, 250. m/0.2 mm/0.33 μm, He, 60. C @ 4. min, 2. K/min, 250. C @ 30. min
CapillaryHP-5MS1079.Setzer, Noletto, et al., 200630. m/0.25 mm/0.25 μm, He, 60. C @ 5. min, 3. K/min; Tend: 280. C
CapillaryHP-51077.3Leffingwell and Alford, 200560. m/0.32 mm/0.25 μm, He, 30. C @ 2. min, 2. K/min, 260. C @ 28. min
CapillaryOV-1011044.Agnaniet, Mounzeo, et al., 200325. m/0.25 mm/0.25 μm, N2, 5. K/min; Tstart: 50. C; Tend: 200. C
CapillarySPB-51076.Doneanu and Anitescu, 199850. m/0.32 mm/0.25 μm, He, 3. K/min, 240. C @ 20. min; Tstart: 60. C
CapillaryCBP-11076.Lamarque, Maestri, et al., 1998He, 4. K/min; Column length: 30. m; Column diameter: 0.25 mm; Tstart: 60. C; Tend: 240. C

Normal alkane RI, non-polar column, custom temperature program

View large format table.

Column type Active phase I Reference Comment
CapillarySE-301058.Vinogradov, 2004Program: not specified
CapillaryHP-51081.2David, Scanlan, et al., 200250. m/0.32 mm/1.05 μm, He; Program: not specified
CapillaryOV-1, SE-30, Methyl silicone, SP-2100, OV-101, DB-1, etc.1057.Waggott and Davies, 1984Hydrogen; Column length: 50. m; Column diameter: 0.32 mm; Program: not specified

Normal alkane RI, polar column, temperature ramp

View large format table.

Column type Active phase I Reference Comment
CapillaryCarbowax 20M1673.Agnaniet, Mounzeo, et al., 200325. m/0.22 mm/0.25 μm, N2, 5. K/min; Tstart: 50. C; Tend: 200. C

Normal alkane RI, polar column, custom temperature program

View large format table.

Column type Active phase I Reference Comment
CapillaryCarbowax 20M1674.Vinogradov, 2004Program: not specified

References

Chen, Kuo, et al., 1986
Chen, C.-C.; Kuo, M.-C.; Liu, S.-E.; Wu, C.-M., Volatile components of salted and pickled prunes (Prunus mume Sieb. et Zucc.), J. Agric. Food Chem., 1986, 34, 1, 140-144, https://doi.org/10.1021/jf00067a038 . [all data]

van den Dool and Kratz, 1963
van den Dool, H.; Kratz, P. Dec., A generalization of the retention index system including linear temperature programmed gas-liquid partition chromatography, J. Chromatogr., 1963, 11, 463-471, https://doi.org/10.1016/S0021-9673(01)80947-X . [all data]