Chrysanthemic acid

Kovats' RI, non-polar column, temperature ramp

Data compiled by: NIST Mass Spectrometry Data Center, William E. Wallace, director

Column type Capillary
Active phase DB-5
Column length (m) 30.
Carrier gas H2
Substrate
Column diameter (mm) 0.25
Phase thickness (μm) 0.25
Tstart (C) 40.
Tend (C) 280.
Heat rate (K/min) 4.
Initial hold (min)
Final hold (min) 30.
I 1283.
ReferenceAvato, Raffo, et al., 2004
Comment MSDC-RI

Phase change data

Data compiled by: William E. Acree, Jr., James S. Chickos

Enthalpy of fusion

ΔfusH (kJ/mol) Temperature (K) Reference
14.51390.7Xue, Wang, et al., 2004

References

Avato, Raffo, et al., 2004
Avato, P.; Raffo, F.; Aldouri, N.A.; Vartanian, S.T., Essential oils of varthemia iphionoides from Jordan, Flavour Fragr. J., 2004, 19, 6, 559-561, https://doi.org/10.1002/ffj.1351 . [all data]