Titanium, η8-cyclooctatetraene-η5-1,2,3,4,5-pentamethylcyclopentadienyl-

Gas phase ion energetics data

Data compiled by: Sharon G. Lias, John E. Bartmess, Joel F. Liebman, John L. Holmes, Rhoda D. Levin, and W. Gary Mallard

Ionization energy determinations

IE (eV) Method Reference Comment
5.28 ± 0.05PEAndrea, Terpstra, et al., 1986Vertical value

References

Andrea, Terpstra, et al., 1986
Andrea, R.R.; Terpstra, A.; Oskam, A.; Bruin, P.; Teuben, J.H., He(I) and He(II) photoelectron spectra of some mixed sandwich compounds of titanium, zirconium and hafnium, J. Organomet. Chem., 1986, 307, 307. [all data]