Hafnium, η7-cycloheptatrienyl-η5-1,2,3,4,5-pentamethylcyclopentadienyl-

Gas phase ion energetics data

Data compiled by: Sharon G. Lias, John E. Bartmess, Joel F. Liebman, John L. Holmes, Rhoda D. Levin, and W. Gary Mallard

Ionization energy determinations

IE (eV) Method Reference Comment
4.07SBlenkers, Bruin, et al., 1985
6.67 ± 0.05PEAndrea, Terpstra, et al., 1986Vertical value

References

Blenkers, Bruin, et al., 1985
Blenkers, J.; Bruin, P.; Bruin, P.; Teuben, J.H., Group IV mixed sandwich compounds: Systhesis of pentamethylcyclopentadienyl-titanium, -zirconium and -hafnium cycloheptatrienyl and cyclooctatetraene complexes, J. Organomet. Chem., 1985, 297, 61. [all data]

Andrea, Terpstra, et al., 1986
Andrea, R.R.; Terpstra, A.; Oskam, A.; Bruin, P.; Teuben, J.H., He(I) and He(II) photoelectron spectra of some mixed sandwich compounds of titanium, zirconium and hafnium, J. Organomet. Chem., 1986, 307, 307. [all data]