4-Nonylphenol

Phase change data

Data compiled by: William E. Acree, Jr., James S. Chickos

Enthalpy of vaporization

ΔvapH (kcal/mol) Temperature (K) Method Reference Comment
15.5502.A,EBStephenson and Malanowski, 1987Based on data from 487. - 595. K. See also Hon, Singh, et al., 1976.

Van Den Dool and Kratz RI, non-polar column, custom temperature program

View large format table.

Column type Active phase I Reference Comment
CapillaryVF-5MS1871.8Mjøs, Meier, et al., 200650. m/0.25 mm/0.25 μm, He; Program: 60C(2min) => 30C/min => 100C => 1C/min =>
CapillaryVF-5MS1876.7Mjøs, Meier, et al., 200650. m/0.25 mm/0.25 μm, He; Program: 60C(2min) => 30C/min => 100C => 2C/min =>
CapillaryVF-5MS1883.4Mjøs, Meier, et al., 200650. m/0.25 mm/0.25 μm, He; Program: 60C(2min) => 30C/min => 100C => 4C/min =>

Normal alkane RI, non-polar column, temperature ramp

View large format table.

Column type Active phase I Reference Comment
CapillaryDB-51889.Czerny, Brueckner, et al., 201130. m/0.32 mm/0.25 μm, Helium, 40. C @ 2. min, 8. K/min, 250. C @ 5. min
CapillaryHP-5 MS1877.Zenkevich, Makarov A.A., et al., 200930. m/0.25 mm/0.25 μm, Helium, 2. K/min, 220. C @ 10. min; Tstart: 50. C

Normal alkane RI, polar column, temperature ramp

View large format table.

Column type Active phase I Reference Comment
CapillaryDB-FFAP2900.Czerny, Brueckner, et al., 201130. m/0.32 mm/0.25 μm, Helium, 40. C @ 2. min, 8. K/min, 230. C @ 5. min

References

Stephenson and Malanowski, 1987
Stephenson, Richard M.; Malanowski, Stanislaw, Handbook of the Thermodynamics of Organic Compounds, 1987, https://doi.org/10.1007/978-94-009-3173-2 . [all data]

Hon, Singh, et al., 1976
Hon, Huynh C.; Singh, Rakesh P.; Kudchadker, Arvind P., Vapor pressure-boiling point measurements of five organic substances by twin ebulliometry, J. Chem. Eng. Data, 1976, 21, 4, 430-431, https://doi.org/10.1021/je60071a011 . [all data]

Mjøs, Meier, et al., 2006
Mjøs, S.A.; Meier, S.; Boitsov, S., Alkylphenol retention indices, J. Chromatogr. A, 2006, 1123, 1, 98-105, https://doi.org/10.1016/j.chroma.2006.05.002 . [all data]

Czerny, Brueckner, et al., 2011
Czerny, M.; Brueckner, R.; Kirchoff, E.; Schmitt, R.; Buettner, A., The influence of molecular structure on odor qualities and odor detection thresholds of volatile alkylated phenols, Chem. Senses, 2011, 1-15, retrieved from http://chemie.oxfordjournals.org. [all data]

Zenkevich, Makarov A.A., et al., 2009
Zenkevich, I.G.; Makarov A.A.; Schrader, S.; Moeder, M., A new version of an additive scheme for the prediction of gas chromatographic retention indices of the 211 structural isomers of 4-nonylphenol, J. Chromatogr. A, 2009, 1216, 18, 4097-4106, https://doi.org/10.1016/j.chroma.2009.03.021 . [all data]