11-Cyclohexyleicosane

Phase change data

Data compiled by: William E. Acree, Jr., James S. Chickos

Enthalpy of fusion

ΔfusH (kcal/mol) Temperature (K) Reference
11.6269.9Parks, Moore, et al., 1949

References

Parks, Moore, et al., 1949
Parks, G.S.; Moore, G.E.; Renquist, M.L.; Naylor, B.F.; McClaine, L.A.; Fujii, P.S.; Hatton, J.A., Thermal data on organic compounds. XXV. Some heat capacity, entropy and free energy data for nine hydrocarbons of high molecular weight, J. Am. Chem. Soc., 1949, 71, 3386-3389. [all data]