Androstane-3,17-diol, (3α,5α,17β)-, 2TMS derivative

Kovats' RI, non-polar column, isothermal

View large format table.

Column type Active phase Temperature (C) I Reference Comment
PackedOV-1210.2555.Brooks, Thawley, et al., 1971

Van Den Dool and Kratz RI, non-polar column, temperature ramp

View large format table.

Column type Active phase I Reference Comment
CapillaryBP-12570.Houghton, Ginn, et al., 1989H2, 5. K/min; Column length: 25. m; Column diameter: 0.3 mm; Tstart: 150. C; Tend: 300. C
CapillaryBP-52580.Houghton, Ginn, et al., 1989H2, 5. K/min; Column length: 25. m; Column diameter: 0.3 mm; Tstart: 150. C; Tend: 300. C

Van Den Dool and Kratz RI, non-polar column, custom temperature program

View large format table.

Column type Active phase I Reference Comment
CapillaryVF-5MS2576.Tret'yakov, 200730. m/0.25 mm/0.25 μm, He; Program: Multi-step temperature program; T(initial)=60C; T(final)=270C

Normal alkane RI, non-polar column, temperature ramp

View large format table.

Column type Active phase I Reference Comment
CapillaryOV-1012546.Pfeifer and Spiteller, 1981H2, 2. K/min; Column length: 50. m; Column diameter: 0.30 mm; Tstart: 150. C; Tend: 300. C

References

Brooks, Thawley, et al., 1971
Brooks, C.J.W.; Thawley, A.R.; Rocher, P.; Middleditch, B.S.; Anthony, G.M.; Stillwell, W.G., Characterization of Steroidal Drug Metabolites by Combined Gas Chromatography-Mass Spectrometry, J. Chromatogr. Sci., 1971, 9, 1, 35-43, https://doi.org/10.1093/chromsci/9.1.35 . [all data]

Houghton, Ginn, et al., 1989
Houghton, E.; Ginn, A.; Teale, P.; Dumasia, M.C.; Copsey, J., Comparison of the use of mass spectrometry and methylene unit values in the determination of the stereochemistry of estranediol, the major urinary metabolite of 19-nortestosterone in the horse, J. Chromatogr., 1989, 479, 73-83, https://doi.org/10.1016/S0021-9673(01)83318-5 . [all data]

Tret'yakov, 2007
Tret'yakov, K.V., Retention Data. NIST Mass Spectrometry Data Center., NIST Mass Spectrometry Data Center, 2007. [all data]

Pfeifer and Spiteller, 1981
Pfeifer, P.; Spiteller, G., Steroid Profiles of Healthy Individuals, J. Chromatogr., 1981, 223, 1, 21-32, https://doi.org/10.1016/S0378-4347(00)80064-X . [all data]