CAS Reg. No. 104120-67-4

Reaction thermochemistry data

Data compiled by: John E. Bartmess

Individual Reactions

(CAS Reg. No. 104120-67-4 • 4294967295cobalt) + cobalt = CAS Reg. No. 104120-67-4

By formula: (CAS Reg. No. 104120-67-4 • 4294967295Co) + Co = CAS Reg. No. 104120-67-4

Quantity Value Units Method Reference Comment
Δr210. ± 8.8kJ/molN/ALeopold and Lineberger, 1986gas phase

References

Leopold and Lineberger, 1986
Leopold, D.G.; Lineberger, W.C., A study of the low-lying electronic states of Fe2 and Co2 by negative ion photoelectron spectroscopy, J. Chem. Phys., 1986, 85, 51. [all data]