Perfluoro(2,3-dimethyl)-4-oxo-diazepentane

Phase change data

Data compiled by: William E. Acree, Jr., James S. Chickos

Enthalpy of vaporization

ΔvapH (kcal/mol) Temperature (K) Method Reference Comment
7.6291.AStephenson and Malanowski, 1987Based on data from 276. - 308. K. See also Dykyj, 1971 and Haszeldine and Tipping, 1966.

References

Stephenson and Malanowski, 1987
Stephenson, Richard M.; Malanowski, Stanislaw, Handbook of the Thermodynamics of Organic Compounds, 1987, https://doi.org/10.1007/978-94-009-3173-2 . [all data]

Dykyj, 1971
Dykyj, J., Petrochemia, 1971, 11, 2, 27. [all data]

Haszeldine and Tipping, 1966
Haszeldine, R.N.; Tipping, A.E., Perfluoroalkyl derivatives of nitrogen. Part XXIII. The photochemical decomposition of tristrifluoromethylhydroxylamine, J. Chem. Soc., C, 1966, 1236, https://doi.org/10.1039/j39660001236 . [all data]