Pentanoic acid, 3,7-dimethyl-2,6-octadienyl ester, (E)-

Van Den Dool and Kratz RI, non-polar column, custom temperature program

Data compiled by: NIST Mass Spectrometry Data Center, William E. Wallace, director

Column type Capillary
Active phase HP-5MS
Column length (m) 30.
Carrier gas He
Substrate
Column diameter (mm) 0.25
Phase thickness (μm) 0.25
Program 60C (1 min) => 5 C/min => 210C => 10 C/min => 280C (15 min)
I 1658.9
ReferenceAndriamaharavo, 2014
Comment MSDC-RI

Normal alkane RI, polar column, temperature ramp

Data compiled by: NIST Mass Spectrometry Data Center, William E. Wallace, director

Column type CapillaryCapillaryCapillary
Active phase DB-WaxInnowaxDB-Wax
Column length (m) 30.60.60.
Carrier gas  HeHe
Substrate
Column diameter (mm) 0.250.250.25
Phase thickness (μm) 0.2 0.25
Tstart (C) 60.60.50.
Tend (C) 250.220.180.
Heat rate (K/min) 6.4.2.5
Initial hold (min) 2.10.5.
Final hold (min)  10.
I 1994.1953.1964.
ReferenceHamilton, Hall, et al., 2005Suleimenov, Atazharova, et al., 2003Stashenko, Puertas, et al., 1996
Comment MSDC-RI MSDC-RI MSDC-RI

Kovats' RI, polar column, temperature ramp

Data compiled by: NIST Mass Spectrometry Data Center, William E. Wallace, director

Column type Capillary
Active phase Carbowax 20M
Column length (m) 25.
Carrier gas N2
Substrate
Column diameter (mm) 0.25
Phase thickness (μm)
Tstart (C) 60.
Tend (C) 200.
Heat rate (K/min) 5.
Initial hold (min)
Final hold (min)
I 1983.
ReferenceKulkarni, Mallavarapu, et al., 1998
Comment MSDC-RI

References

Andriamaharavo, 2014
Andriamaharavo, N.R., Retention Data. NIST Mass Spectrometry Data Center., NIST Mass Spectrometry Data Center, 2014. [all data]