1,7,7-Trimethyl-2-norbornanone dimethyl ketal

Phase change data

Data compiled by: Hussein Y. Afeefy, Joel F. Liebman, and Stephen E. Stein

Quantity Value Units Method Reference Comment
Δvap61.30kJ/molEWiberg and Cunningham, 1990Heat of hydrolysis

Reaction thermochemistry data

Data compiled by: Hussein Y. Afeefy, Joel F. Liebman, and Stephen E. Stein

Individual Reactions

1,7,7-Trimethyl-2-norbornanone dimethyl ketal + Water = 2Methyl Alcohol + Camphor

By formula: C12H22O2 + H2O = 2CH4O + C10H16O

Quantity Value Units Method Reference Comment
Δr7.73 ± 0.36kJ/molCmWiberg and Cunningham, 1990liquid phase; Heat of hydrolysis

References

Wiberg and Cunningham, 1990
Wiberg, K.B.; Cunningham, W.C., Jr., Thermochemical studies of carbonyl reactions. 4. Enthalpies of hydrolysis of norbornyl ketals, J. Org. Chem., 1990, 55, 679-684. [all data]