Benzenemethanamine, N,N-dimethyl-

Van Den Dool and Kratz RI, non-polar column, temperature ramp

View large format table.

Column type Active phase I Reference Comment
CapillaryDB-11017.9Sun and Stremple, 200330. m/0.25 mm/0.25 μm, He, 3. K/min; Tstart: 40. C; Tend: 325. C
CapillaryOV-11025.5Gautzsch and Zinn, 19968. K/min; Tstart: 35. C; Tend: 300. C

Normal alkane RI, polar column, custom temperature program

View large format table.

Column type Active phase I Reference Comment
CapillaryDB-Wax1350.Peng, Yang, et al., 1991Program: not specified

Phase change data

Data compiled as indicated in comments:
BS - Robert L. Brown and Stephen E. Stein
AC - William E. Acree, Jr., James S. Chickos

Quantity Value Units Method Reference Comment
Tboil454.2KN/AWeast and Grasselli, 1989BS
Tboil454.KN/ABuckingham and Donaghy, 1982BS
Quantity Value Units Method Reference Comment
Δvap11.8 ± 0.1kcal/molGSVerevkin, 1999Based on data from 288. - 328. K.; AC
Δvap12.0 ± 0.2kcal/molCMiroshnichenko, Orlov, et al., 1996AC

Reduced pressure boiling point

Tboil (K) Pressure (atm) Reference Comment
456.71.01Aldrich Chemical Company Inc., 1990BS
339. - 340.0.020Buckingham and Donaghy, 1982BS

Enthalpy of vaporization

ΔvapH (kcal/mol) Temperature (K) Method Reference Comment
11.7 ± 0.1308.GSVerevkin, 1999Based on data from 288. - 328. K.; AC

Gas phase ion energetics data

Data evaluated as indicated in comments:
HL - Edward P. Hunter and Sharon G. Lias
L - Sharon G. Lias

Data compiled as indicated in comments:
LLK - Sharon G. Lias, Rhoda D. Levin, and Sherif A. Kafafi

Quantity Value Units Method Reference Comment
IE (evaluated)7.69 ± 0.05eVN/AN/AL
Quantity Value Units Method Reference Comment
Proton affinity (review)231.5kcal/molN/AHunter and Lias, 1998HL
Quantity Value Units Method Reference Comment
Gas basicity224.0kcal/molN/AHunter and Lias, 1998HL

Ionization energy determinations

IE (eV) Method Reference Comment
7.69 ± 0.03PILoguinov, Takhistov, et al., 1981LLK
7.8PEAue and Bowers, 1979LLK
7.69 ± 0.05PEAkopyan and Loginov, 1974LLK

Appearance energy determinations

Ion AE (eV) Other Products MethodReferenceComment
C3H8N+9.52 ± 0.05C6H5PILoguinov, Takhistov, et al., 1981LLK

References

Sun and Stremple, 2003
Sun, G.; Stremple, P., Retention index characterization of flavor, fragrance, and many other compounds on DB-1 and DB-XLB, 2003, retrieved from http://www.chem.agilent.com/cag/cabu/pdf/b-0279.pdf. [all data]

Gautzsch and Zinn, 1996
Gautzsch, R.; Zinn, P., Use of incremental models to estimate the retention indexes of aromatic compounds, Chromatographia, 1996, 43, 3/4, 163-176, https://doi.org/10.1007/BF02292946 . [all data]

Peng, Yang, et al., 1991
Peng, C.T.; Yang, Z.C.; Ding, S.F., Prediction of rentention idexes. II. Structure-retention index relationship on polar columns, J. Chromatogr., 1991, 586, 1, 85-112, https://doi.org/10.1016/0021-9673(91)80028-F . [all data]