2-Chlorotricyclo[3.3.1.13,7decane-1-carboxylic acid, methyl ester

Gas phase ion energetics data

Data compiled by: Sharon G. Lias, John E. Bartmess, Joel F. Liebman, John L. Holmes, Rhoda D. Levin, and W. Gary Mallard

Appearance energy determinations

Ion AE (eV) Other Products MethodReferenceComment
C10H14Cl+9.8 ± 0.2?PIZauer and Takhistov, 1986

References

Zauer and Takhistov, 1986
Zauer, O.A.; Takhistov, V.V., Heats of formation of 1-adamantyl cations in the gas phase, J. Org. Chem. USSR, 1986, 22, 601. [all data]