2-Propenoic acid, 3-phenyl-, 2-phenylethyl ester

Van Den Dool and Kratz RI, non-polar column, temperature ramp

View large format table.

Column type Active phase I Reference Comment
CapillaryPE-52158.Isidorov and Vinogorova, 2003He, 3. K/min; Column length: 30. m; Column diameter: 0.25 mm; Tstart: 40. C; Tend: 280. C
PackedSE-302143.van den Dool and Kratz, 1963Celite; Tstart: 75. C; Tend: 228. C

Normal alkane RI, non-polar column, temperature ramp

View large format table.

Column type Active phase I Reference Comment
CapillaryDB-12150.Tohar, Mohd, et al., 200630. m/0.32 mm/0.25 μm, 60. C @ 3. min, 3. K/min, 230. C @ 10. min

Normal alkane RI, non-polar column, custom temperature program

View large format table.

Column type Active phase I Reference Comment
CapillarySE-302147.Vinogradov, 2004Program: not specified
CapillaryOV-1, SE-30, Methyl silicone, SP-2100, OV-101, DB-1, etc.2125.Waggott and Davies, 1984Hydrogen; Column length: 50. m; Column diameter: 0.32 mm; Program: not specified

Normal alkane RI, polar column, custom temperature program

View large format table.

Column type Active phase I Reference Comment
CapillaryCarbowax 20M3100.Vinogradov, 2004Program: not specified

References

Isidorov and Vinogorova, 2003
Isidorov, V.A.; Vinogorova, V.T., GC-MS analysis of compounds extracted from buds of Populus balsamifera and Populus nigra, Z. Naturforsch. C:, 2003, 58, 355-360. [all data]

van den Dool and Kratz, 1963
van den Dool, H.; Kratz, P. Dec., A generalization of the retention index system including linear temperature programmed gas-liquid partition chromatography, J. Chromatogr., 1963, 11, 463-471, https://doi.org/10.1016/S0021-9673(01)80947-X . [all data]

Tohar, Mohd, et al., 2006
Tohar, N.; Mohd, M.A.; Jantan, I.; Awang, K., A comparative study of the essential oils of the genus Plumeria Linn. from Malaysia, Flavour Fragr. J., 2006, 21, 6, 859-863, https://doi.org/10.1002/ffj.1617 . [all data]

Vinogradov, 2004
Vinogradov, B.A., Production, composition, properties and application of essential oils, 2004, retrieved from http://viness.narod.ru. [all data]

Waggott and Davies, 1984
Waggott, A.; Davies, I.W., Identification of organic pollutants using linear temperature programmed retention indices (LTPRIs) - Part II, 1984, retrieved from http://dwi.defra.gov.uk/research/completed-research/reports/dwi0383.pdf. [all data]