Propanoic acid, 2-methyl-, 2-phenylethyl ester

Normal alkane RI, non-polar column, temperature ramp

Data compiled by: NIST Mass Spectrometry Data Center, William E. Wallace, director

Column type CapillaryCapillaryCapillary
Active phase ZB-1DB-1ZB-1
Column length (m) 30.30.30.
Carrier gas NitrogenHeN2
Substrate
Column diameter (mm) 0.25 0.25
Phase thickness (μm) 0.250.250.25
Tstart (C) 45.50.45.
Tend (C) 230.220.230.
Heat rate (K/min) 3.6.3.
Initial hold (min)  2.
Final hold (min)  20.
I 1368.1371.1368.
ReferenceMierendorff, Stahl-Biskup, et al., 2008Audino, Alzogaray, et al., 2007Mierendorff, Stahl-Biskup, et al., 2003
Comment MSDC-RI MSDC-RI MSDC-RI

Kovats' RI, polar column, temperature ramp

Data compiled by: NIST Mass Spectrometry Data Center, William E. Wallace, director

Column type CapillaryCapillary
Active phase Supelcowax-10Carbowax 20M
Column length (m) 60.50.
Carrier gas HeHe
Substrate
Column diameter (mm) 0.250.28
Phase thickness (μm)
Tstart (C) 35.70.
Tend (C) 200.190.
Heat rate (K/min) 3.2.
Initial hold (min) 5.
Final hold (min) 20.
I 1883.1935.
ReferenceWong and Teng, 1994Tressl, Friese, et al., 1978
Comment MSDC-RI MSDC-RI

References

Mierendorff, Stahl-Biskup, et al., 2008
Mierendorff, H.-G.; Stahl-Biskup, E.; Posthumus, M.A.; van Beek, T.A., Composition of commercial Cape chamomile oil (Eriocephalus punctuatus / Eriocephalus tenuifolius), 2008, retrieved from http://www.chemische-analysen-hamburg.de/Publikationen?CapeChamomileOil/. [all data]

Audino, Alzogaray, et al., 2007
Audino, P.G.; Alzogaray, R.A.; Vassena, C.; Masuh, H.; Fontán, A.; Gatti, P.; Martínez, A.; Camps, F.; Cork, A.; Zerba, E., Volatile compounds secreted by Brindley's glands of adult Triatoma infestans: identification and biological activity of previously unidentified compounds, Journal of Vector Ecology, 2007, 32, 1, 75-82, https://doi.org/10.3376/1081-1710(2007)32[75:VCSBBO]2.0.CO;2 . [all data]

Mierendorff, Stahl-Biskup, et al., 2003
Mierendorff, H.-G.; Stahl-Biskup, E.; Posthumus, M.A.; van Beek, T.A., Composition of commercial Cape chamomile oil (Eriocephalus punctulatus), Flavour Fragr. J., 2003, 18, 6, 510-514, https://doi.org/10.1002/ffj.1259 . [all data]