1,2,3,5,6,7-Hexachloronaphthalene

Phase change data

Data compiled by: William E. Acree, Jr., James S. Chickos

Enthalpy of vaporization

ΔvapH (kcal/mol) Temperature (K) Method Reference Comment
20.2373.GCLei, Wania, et al., 1999Based on data from 323. - 423. K.

References

Lei, Wania, et al., 1999
Lei, Ying Duan; Wania, Frank; Shiu, Wan Ying, Vapor Pressures of the Polychlorinated Naphthalenes, J. Chem. Eng. Data, 1999, 44, 3, 577-582, https://doi.org/10.1021/je9802827 . [all data]