Disulfide, bis(4-methylphenyl)

Gas phase ion energetics data

Data compiled by: Sharon G. Lias, John E. Bartmess, Joel F. Liebman, John L. Holmes, Rhoda D. Levin, and W. Gary Mallard

Ionization energy determinations

IE (eV) Method Reference Comment
7.5PEGiordon and Bock, 1982
8.0PEGiordon and Bock, 1982Vertical value

References

Giordon and Bock, 1982
Giordon, J.; Bock, H., Radical ions, 51. Oxidative rearrangement of diphenyl disulfides to thianthrenes, Chem. Ber., 1982, 115, 2548. [all data]