(2S)-2-methyl-ethyl ester-butanoic acid

Van Den Dool and Kratz RI, non-polar column, custom temperature program

Data compiled by: NIST Mass Spectrometry Data Center, William E. Wallace, director

Column type CapillaryCapillaryCapillaryCapillaryCapillary
Active phase SE-54SE-54CP Sil 8 CBRTX-5SE-54
Column length (m) 30.30.25. 30.
Carrier gas HeHeHe He
Substrate
Column diameter (mm) 0.320.320.32 0.32
Phase thickness (μm) 0.250.250.25 0.25
Program 35C(2min) => 40C/min => 50C(2min) => 6C/min => 180C => 20C/min => 230C(10min)35C(2min) => 40C/min => 50C(2min) => 6C/min => 180C => 20C/min => 230C(10min)35C(2min) => 5C/min => 170C => 20C/min => 240C (10min)not specified35C (2min) => 40C/min => 50C (2min) => 6C/min => 180C => 10C/min => 230C (10min)
I 845.855.848.848.845.
ReferenceFritsch and Schieberle, 2005Fritsch and Schieberle, 2005Fuhrmann and Grosch, 2002Fuhrmann and Grosch, 2002Buettner and Schieberle, 1999
Comment MSDC-RI MSDC-RI MSDC-RI MSDC-RI MSDC-RI
Column type Capillary
Active phase SE-54
Column length (m) 30.
Carrier gas He
Substrate
Column diameter (mm) 0.32
Phase thickness (μm) 0.25
Program 35C(2min) => 40C/min => 50C(2min) => 6C/min => 180C => 10C/min => 230C(10min)
I 845.
ReferenceHinterholzer and Schieberie, 1998
Comment MSDC-RI

References

Fritsch and Schieberle, 2005
Fritsch, H.T.; Schieberle, P., Identification based on quantitative measurements and aroma recombination of the character impact odorants in a Bavarian Pilsner-type beer, J. Agric. Food Chem., 2005, 53, 19, 7544-7551, https://doi.org/10.1021/jf051167k . [all data]

Fuhrmann and Grosch, 2002
Fuhrmann, E.; Grosch, W., Character impact odorants of the apple cultivars Elstar and Cox Orange, Nahrung/Food, 2002, 46, 3, 187-193, https://doi.org/10.1002/1521-3803(20020501)46:3<187::AID-FOOD187>3.0.CO;2-5 . [all data]

Buettner and Schieberle, 1999
Buettner, A.; Schieberle, P., Characterization of the most odor-active volatiles in fresh, hand squeezed juice of grapefruit (Citrus paradise Macfayden), J. Agric. Food Chem., 1999, 47, 12, 5189-5193, https://doi.org/10.1021/jf990071l . [all data]

Hinterholzer and Schieberie, 1998
Hinterholzer, A.; Schieberie, P., Identification of the most odour-active volatiles in fresh, hand-extracted juice of valencia late oranges by odour dilution techniques, Flavour Fragr. J., 1998, 13, 1, 49-55, https://doi.org/10.1002/(SICI)1099-1026(199801/02)13:1<49::AID-FFJ691>3.0.CO;2-S . [all data]