1,2-Propanediol, 3-(hexyloxy)-

Phase change data

Data compiled as indicated in comments:
TRC - Thermodynamics Research Center, NIST Boulder Laboratories, Chris Muzny director
AC - William E. Acree, Jr., James S. Chickos

Quantity Value Units Method Reference Comment
Tfus270.KN/Avan Doren and van der Geest, 1990Uncertainty assigned by TRC = 3. K; TRC

Enthalpy of fusion

ΔfusH (kJ/mol) Temperature (K) Method Reference Comment
10.2272.9DSCvan Doren, van der Geest, et al., 2010AC

In addition to the Thermodynamics Research Center (TRC) data available from this site, much more physical and chemical property data is available from the following TRC products:

References

van Doren and van der Geest, 1990
van Doren, H.A.; van der Geest, R., A comparative study of the liquid-crystalline behavior of three homologous series of 1,2-propanediol derivatives, Recl.: J. R. Neth. Chem. Soc., 1990, 109, 197. [all data]

van Doren, van der Geest, et al., 2010
van Doren, Henk A.; van der Geest, Ralph; Kellogg, Richard M.; Wynberg, Hans, A comparative study of the liquid-crystalline behavior of three homologous series of 1,2-propanediol derivatives, Recl. Trav. Chim. Pays-Bas, 2010, 109, 3, 197-203, https://doi.org/10.1002/recl.19901090312 . [all data]