Cinnamoyl chloride

Phase change data

Data compiled by: Robert L. Brown and Stephen E. Stein

Quantity Value Units Method Reference Comment
Tboil530.2KN/AWeast and Grasselli, 1989

Lee's RI, non-polar column, custom temperature program

View large format table.

Column type Active phase I Reference Comment
CapillaryDB-5MS240.5Aracil, Font, et al., 2005Column length: 60. m; Column diameter: 0.25 mm; Program: not specified

References

Weast and Grasselli, 1989
CRC Handbook of Data on Organic Compounds, 2nd Editon, Weast,R.C and Grasselli, J.G., ed(s)., CRC Press, Inc., Boca Raton, FL, 1989, 1. [all data]

Aracil, Font, et al., 2005
Aracil, I.; Font, R.; Conesa, J.A., Semivolatile and volatile compounds from the pyrolysis and combustion of polyvinyl chloride, J. Anal. Appl. Pyrolysis, 2005, 74, 1-2, 465-478, https://doi.org/10.1016/j.jaap.2004.09.008 . [all data]