N,N-dioctadecyl-1-octadecanamine

Phase change data

Data compiled by: Thermodynamics Research Center, NIST Boulder Laboratories, Chris Muzny director

Quantity Value Units Method Reference Comment
Tfus327.15KN/ARalston, Hoerr, et al., 1944Uncertainty assigned by TRC = 1. K
Tfus327.65KN/AStaudinger and Roessler, 1936Uncertainty assigned by TRC = 1. K

In addition to the Thermodynamics Research Center (TRC) data available from this site, much more physical and chemical property data is available from the following TRC products:

References

Ralston, Hoerr, et al., 1944
Ralston, A.W.; Hoerr, C.W.; Du Brow, P.L., Solubilities of High-Molecular-Weight Symmetrical Normal Aliphatic Tertiary Amines., J. Org. Chem., 1944, 9, 259-66. [all data]

Staudinger and Roessler, 1936
Staudinger, H.; Roessler, K., Highly Polymerized Compounds. CXXIII. Viscosity Measurements on Long- Chain Aliphatic Amines., Chem. Ber., 1936, 69B, 49-60. [all data]