1-Hexanamine, N,N-dihexyl-

Phase change data

Data compiled as indicated in comments:
BS - Robert L. Brown and Stephen E. Stein
TRC - Thermodynamics Research Center, NIST Boulder Laboratories, Chris Muzny director

Quantity Value Units Method Reference Comment
Tboil536.7KN/AWeast and Grasselli, 1989BS
Tboil564.15KN/ASudaricov, Phrolov, et al., 1963Uncertainty assigned by TRC = 2. K; TRC
Tboil537.15KN/AMailhe, 1918Uncertainty assigned by TRC = 3. K; TRC
Tboil533.15KN/APetersen, 1857Uncertainty assigned by TRC = 4. K; TRC

In addition to the Thermodynamics Research Center (TRC) data available from this site, much more physical and chemical property data is available from the following TRC products:

Kovats' RI, non-polar column, temperature ramp

View large format table.

Column type Active phase I Reference Comment
CapillaryDB-11740.Hall, Whitehead, et al., 1986He, 6. K/min; Column length: 15. m; Column diameter: 0.25 mm; Tstart: 100. C; Tend: 270. C
CapillaryDB-51741.Hall, Whitehead, et al., 1986He, 6. K/min; Column length: 15. m; Column diameter: 0.25 mm; Tstart: 100. C; Tend: 270. C

Normal alkane RI, non-polar column, temperature ramp

View large format table.

Column type Active phase I Reference Comment
CapillaryUltra-11730.Okumura, 199125. m/0.32 mm/0.25 μm, He, 3. K/min; Tstart: 80. C; Tend: 260. C

References

Weast and Grasselli, 1989
CRC Handbook of Data on Organic Compounds, 2nd Editon, Weast,R.C and Grasselli, J.G., ed(s)., CRC Press, Inc., Boca Raton, FL, 1989, 1. [all data]

Sudaricov, Phrolov, et al., 1963
Sudaricov, B.N.; Phrolov, U.G.; Ilichev, V.A.I.; Pushcov, A.A.; Zaharov-Narcissov, O.I.; Ochkin, A.B., Physicochemical Properties of Certain n-Aliphatic Amines, Tr. Inst. - Mosk. Khim. -Tekhnol. Inst. im. D. I. Mendele- eva, 1963, 43, 21. [all data]

Mailhe, 1918
Mailhe, A., Direct Transformation of secondary and tertiary amines to nitriles, C. R. Hebd. Seances Acad. Sci., 1918, 166, 996. [all data]

Petersen, 1857
Petersen, T., On Tricapronylamine, Justus Liebigs Ann. Chem., 1857, 102, 312. [all data]