Benzene, 1-methoxy-2-(1-methylethenyl)-

Kovats' RI, non-polar column, temperature ramp

View large format table.

Column type Active phase I Reference Comment
CapillaryMethyl Silicone1094.Palá-Paúl, Pérez-Alonso, et al., 200250. m/0.25 mm/0.25 μm, He, 4. K/min; Tstart: 70. C; Tend: 240. C

References

Palá-Paúl, Pérez-Alonso, et al., 2002
Palá-Paúl, J.; Pérez-Alonso, M.J.; Velasco-Negueruela, A.; Sanz, J., Essential oil composition of Schizogyne glaberrima DC, a species endemic to the Canary Islands, Flavour Fragr. J., 2002, 17, 1, 13-14, https://doi.org/10.1002/ffj.1043 . [all data]