7-Oxabicyclo[4.1.0]heptan-2-one, 4,4,6-trimethyl-

Normal alkane RI, non-polar column, custom temperature program

View large format table.

Column type Active phase I Reference Comment
CapillaryHP-5 MS1333.Jalali-Heravi, Parastar, et al., 200960. m/0.25 mm/0.25 μm, Helium; Program: 60 0C ( 1 min) 5 0C/min -> 200 0C (1 min) 20 0C/min -> 280 0C (21 min)

References

Jalali-Heravi, Parastar, et al., 2009
Jalali-Heravi, M.; Parastar, H.; Ebrahimi-Najafabadi, H., Chracterization of volatile components of Iranian saffron using factorial-based response surface modeling of ultrasonic extraction combined with gas chromatography - mass spectrometry analysis, J. Chromatogr. A, 2009, 1216, 33, 6088-6097, https://doi.org/10.1016/j.chroma.2009.06.067 . [all data]