Maprotiline

Normal alkane RI, non-polar column, temperature ramp

Data compiled by: NIST Mass Spectrometry Data Center, William E. Wallace, director

Column type Capillary
Active phase DB-5
Column length (m) 15.
Carrier gas He
Substrate
Column diameter (mm) 0.25
Phase thickness (μm) 0.2
Tstart (C) 185.
Tend (C) 270.
Heat rate (K/min) 10.
Initial hold (min)
Final hold (min)
I 2299.
ReferencePhillips, Logan, et al., 1990
Comment MSDC-RI

References

Phillips, Logan, et al., 1990
Phillips, A.M.; Logan, B.K.; Stafford, D.T., Further applications for capillary gas chromatography in routine quantitative toxicological analyses, J. Hi. Res. Chromatogr., 1990, 13, 11, 754-758, https://doi.org/10.1002/jhrc.1240131106 . [all data]