3,7,11,15-Tetramethyl-2-hexadecen-1-ol

Van Den Dool and Kratz RI, non-polar column, temperature ramp

View large format table.

Column type Active phase I Reference Comment
CapillarySE-542119.33Yin, Xiu, et al., 200135. C @ 3. min, 4. K/min, 230. C @ 10. min; Column length: 25. m; Column diameter: 0.31 mm
CapillarySE-542116.Li, Wang, et al., 1998H2, 35. C @ 3. min, 4. K/min; Column length: 25. m; Column diameter: 0.31 mm; Tend: 250. C

Van Den Dool and Kratz RI, non-polar column, custom temperature program

View large format table.

Column type Active phase I Reference Comment
CapillarySE-542114.Li, Wang, et al., 1998H2; Column length: 25. m; Column diameter: 0.31 mm; Program: not specified

References

Yin, Xiu, et al., 2001
Yin, W.; Xiu, Z.; Aijin, H., Analysis of the volatile components in trogopterorum feces by capillary gas chromatography and gas chromatography/mass spectrometry, Fenxi Huaxue, 2001, 29, 2, 195-198. [all data]

Li, Wang, et al., 1998
Li, W.; Wang, H.; Sun, Y.; Huang, A.; Sun, Y., Capillary gas chromatographic analysis of volatile components in goat feces, Fenxi Huaxue, 1998, 26, 8, 935-939. [all data]