3-Hydroxy-β-damascone

Van Den Dool and Kratz RI, polar column, temperature ramp

Data compiled by: NIST Mass Spectrometry Data Center, William E. Wallace, director

Column type CapillaryCapillaryCapillaryCapillaryCapillary
Active phase DB-WaxDB-WaxDB-WaxDB-WaxDB-Wax
Column length (m) 30.30.30.30.30.
Carrier gas He  HeHe
Substrate
Column diameter (mm) 0.250.320.320.320.32
Phase thickness (μm) 0.250.50.50.50.5
Tstart (C) 50.40.40.60.60.
Tend (C) 220.245.245.245.245.
Heat rate (K/min) 4.3.2.3.3.
Initial hold (min) 4.3.3.3.3.
Final hold (min) 20.20.20.20.20.
I 2535.2563.2537.2537.2531.
ReferenceOsorio, Alarcon, et al., 2006Aubert, Ambid, et al., 2003Aubert, Günata, et al., 2003Wirth, Guo, et al., 2001Bureau, Baumes, et al., 2000
Comment MSDC-RI MSDC-RI MSDC-RI MSDC-RI MSDC-RI
Column type CapillaryCapillaryCapillaryCapillaryCapillary
Active phase DB-WaxDB-WaxDB-WaxCP-Wax 58CBCarbowax 20M
Column length (m) 30.30.30.30.30.
Carrier gas  HeHeHeHe
Substrate
Column diameter (mm) 0.320.250.250.250.25
Phase thickness (μm) 0.50.250.250.220.25
Tstart (C) 60.50.50.40.40.
Tend (C) 245.220.240.220.240.
Heat rate (K/min) 3.4.4.3.4.
Initial hold (min) 3.3.3. 3.
Final hold (min) 20.20.
I 2532.2525.2504.2504.2563.
ReferenceBureau, Razungles, et al., 2000Humpf and Schreier, 1991Krammer, Winterhalter, et al., 1991Pabst, Barron, et al., 1991Schwab, Mahr, et al., 1989
Comment MSDC-RI MSDC-RI MSDC-RI MSDC-RI MSDC-RI

Van Den Dool and Kratz RI, non-polar column, temperature ramp

View large format table.

Column type Active phase I Reference Comment
CapillaryHP-1011627.Politeo, Jukic, et al., 200725. m/0.2 mm/0.2 μm, He, 70. C @ 2. min, 3. K/min, 200. C @ 15. min
CapillaryDB-11663.Osorio, Alarcon, et al., 200625. m/0.2 mm/0.33 μm, 4. K/min; Tstart: 50. C; Tend: 300. C
CapillaryDB-11591.Coen, Engel, et al., 199530. m/0.32 mm/0.25 μm, N2, 3. K/min; Tstart: 150. C; Tend: 280. C

Van Den Dool and Kratz RI, polar column, custom temperature program

View large format table.

Column type Active phase I Reference Comment
CapillaryCarbowax 20M2537.Boido, Lloret, et al., 200325. m/0.32 mm/0.25 μm, H2; Program: 40C (8min) => 3C/min => 180C => 20C/min => 230C

Normal alkane RI, non-polar column, temperature ramp

View large format table.

Column type Active phase I Reference Comment
CapillaryHP-5 MS1617.Jerkovic, Hegic, et al., 201030. m/0.25 mm/0.25 μm, Helium, 70. C @ 2. min, 3. K/min, 200. C @ 18. min
CapillarySPB-51640.Kilic, Kollmannsberger, et al., 2005He, 5. K/min; Column length: 30. m; Column diameter: 0.53 mm; Tstart: 100. C; Tend: 250. C

Normal alkane RI, non-polar column, custom temperature program

View large format table.

Column type Active phase I Reference Comment
Capillary 1618.Brandi, Bar, et al., 2011Program: not specified

Normal alkane RI, polar column, temperature ramp

View large format table.

Column type Active phase I Reference Comment
CapillaryDB-Wax Etr2559.Ibarz, Ferreira, et al., 200660. m/0.25 mm/0.25 μm, He, 40. C @ 5. min, 2. K/min, 230. C @ 100. min
CapillaryInnowax2546.Joichi, Yomogida, et al., 200560. m/0.25 mm/0.25 μm, He, 5. K/min, 240. C @ 30. min; Tstart: 60. C
CapillaryTC-Wax2535.Shuichi, Masazumi, et al., 199680. C @ 5. min, 3. K/min; Column length: 60. m; Column diameter: 0.25 mm; Tend: 240. C

Normal alkane RI, polar column, custom temperature program

View large format table.

Column type Active phase I Reference Comment
CapillaryDB-Wax2537.Schneider, Razungles, et al., 200130. m/0.25 mm/0.5 μm, He; Program: 30C => 70C/min => 60C (3min) => 3C/min => 245C (20min)
CapillaryDB-Wax2544.Marlatt, Ho, et al., 199230. m/0.25 mm/0.25 μm; Program: not specified

References

Osorio, Alarcon, et al., 2006
Osorio, C.; Alarcon, M.; Moreno, C.; Bonilla, A.; Barrios, J.; Garzon, C.; Duque, C., Characterization of Odor-Active Volatiles in Champa ( Campomanesia lineatifolia R. P.), J. Agric. Food Chem., 2006, 54, 2, 509-516, https://doi.org/10.1021/jf052098c . [all data]

Aubert, Ambid, et al., 2003
Aubert, C.; Ambid, C.; Baumes, R.; Günata, Z., Investigation of bound aroma constituents of yellow-fleshed nectarines (Prunus persica L. Cv. Springbright). Changes in bound aroma profile during maturation, J. Agric. Food Chem., 2003, 51, 21, 6280-6286, https://doi.org/10.1021/jf034613h . [all data]

Aubert, Günata, et al., 2003
Aubert, C.; Günata; Ambid, C.; Baumes, R., Changes in physicochemical characteristics and volatile constituents of yellow- and white-fleshed nectarines during maturation and artificial ripening, J. Agric. Food Chem., 2003, 51, 10, 3083-3091, https://doi.org/10.1021/jf026153i . [all data]

Wirth, Guo, et al., 2001
Wirth, J.; Guo, W.; Baumes, R.; Günata, Z., Volatile compounds released by enzymatic hydrolysis of glycoconjugates of leaves and grape berries from Vitis vinifera muscat of Alexandria and Shiraz cultivars, J. Agric. Food Chem., 2001, 49, 6, 2917-2923, https://doi.org/10.1021/jf001398l . [all data]

Bureau, Baumes, et al., 2000
Bureau, S.M.; Baumes, R.L.; Razungles, A.J., Effects of vine or bunch shading on the glycosylated flavor precursors in grapes of Vitis vinifera L. Cv. Syrah, J. Agric. Food Chem., 2000, 48, 4, 1290-1297, https://doi.org/10.1021/jf990507x . [all data]

Bureau, Razungles, et al., 2000
Bureau, S.M.; Razungles, A.R.; Baumes, R.L., The aroma of Muscat of Frontignan grapes: effect of the light environment of vine or bunch on volatiles and glycoconjugates, J. Sci. Food Agric., 2000, 80, 14, 2012-2020, https://doi.org/10.1002/1097-0010(200011)80:14<2012::AID-JSFA738>3.0.CO;2-X . [all data]

Humpf and Schreier, 1991
Humpf, H.-U.; Schreier, P., Bound aroma compounds from the fruit and the leaves of blackberry (Rubus laciniata L.), J. Agric. Food Chem., 1991, 39, 10, 1830-1832, https://doi.org/10.1021/jf00010a028 . [all data]

Krammer, Winterhalter, et al., 1991
Krammer, G.; Winterhalter, P.; Schwab, M.; Schreier, P., Glycosidically bound aroma compounds in the fruits of Prunus species: Apricot (P. armeniaca, L.) peach (P. persica, L.) yellow plum (P. domestica, L. ssp. Syriaca), J. Agric. Food Chem., 1991, 39, 4, 778-781, https://doi.org/10.1021/jf00004a032 . [all data]

Pabst, Barron, et al., 1991
Pabst, A.; Barron, D.; Etiévant, P.; Schreier, P., Studies on the enzymatic hydrolysis of bound aroma constituents from raspberry fruit pulp, J. Agric. Food Chem., 1991, 39, 1, 173-175, https://doi.org/10.1021/jf00001a034 . [all data]

Schwab, Mahr, et al., 1989
Schwab, W.; Mahr, C.; Schreier, P., Studies on the enzymic hydrolysis of bound aroma components from Carica papaya fruit, J. Agric. Food Chem., 1989, 37, 4, 1009-1012, https://doi.org/10.1021/jf00088a042 . [all data]