Benzene, 4-(chloromethyl)-1,2-dimethyl-

Phase change data

Data compiled by: Robert L. Brown and Stephen E. Stein

Reduced pressure boiling point

Tboil (K) Pressure (atm) Reference
389.70.032Aldrich Chemical Company Inc., 1990

Normal alkane RI, non-polar column, temperature ramp

View large format table.

Column type Active phase I Reference Comment
CapillaryOV-1011233.Zenkevich and Makarov, 2007N2, 6. K/min; Column length: 25. m; Column diameter: 0.2 mm; Tstart: 60. C; Tend: 240. C
CapillaryOV-1011200.Zenkevich, 2001N2, 4. K/min; Column length: 25. m; Column diameter: 0.20 mm; Tstart: 60. C; Tend: 240. C

References

Aldrich Chemical Company Inc., 1990
Aldrich Chemical Company Inc., Catalog Handbook of Fine Chemicals, Aldrich Chemical Company, Inc., Milwaukee WI, 1990, 1. [all data]

Zenkevich and Makarov, 2007
Zenkevich, I.G.; Makarov, A.A., Identification of Alkylarene Chloromethylation Products Using Gas-Chromatographic Retention Indices, Russian Journal of General Chemistry, 2007, 77, 4, 611-619, https://doi.org/10.1134/S1070363207040196 . [all data]

Zenkevich, 2001
Zenkevich, I.G., Interpretation of Gas Chromatographic Retention Indices in estimation of Structures of Isomeric Products of Radical Chlorinating of Alkyl Arenes, Zh. Org. Khim., 2001, 37, 2, 283-293. [all data]