Ethyl 5-methylhexanoate

Normal alkane RI, non-polar column, temperature ramp

View large format table.

Column type Active phase I Reference Comment
CapillaryRTX-51072.Setkova, Risticevic, et al., 200710. m/0.18 mm/0.2 μm, He, 40. C @ 0.5 min, 50. K/min, 275. C @ 0.5 min

Normal alkane RI, non-polar column, custom temperature program

View large format table.

Column type Active phase I Reference Comment
CapillaryPolydimethyl siloxane with 5 % Ph groups1064.Robinson, Adams, et al., 2012Program: not specified
CapillaryPolydimethyl siloxane with 5 % Ph groups1072.Robinson, Adams, et al., 2012Program: not specified

References

Setkova, Risticevic, et al., 2007
Setkova, L.; Risticevic, S.; Pawliszyn, J., Rapid headspace solid-phase microextraction-gas chromatographic?time-of-flight mass spectrometric method for qualitative profiling of ice wine volatile fraction II: Classification of Canadian and Czech ice wines using statistical evaluation of the data, J. Chromatogr. A, 2007, 1147, 2, 224-240, https://doi.org/10.1016/j.chroma.2007.02.052 . [all data]

Robinson, Adams, et al., 2012
Robinson, A.L.; Adams, D.O.; Boss, P.K.; Heymann, H.; Solomon, P.S.; Trengove, R.D., Influence of geographic origine on the sensory characteristics and wine composition of Vitus viniferas cv. Cabernet Sauvignon wines from Australia (Supplemental data), Am. J. Enol. Vitic., 2012, 64, 4, 467-476, https://doi.org/10.5344/ajev.2012.12023 . [all data]