2,4-Heptadienoic acid, 6-methyl-, ethyl ester

Van Den Dool and Kratz RI, non-polar column, temperature ramp

View large format table.

Column type Active phase I Reference Comment
CapillarySPB-51296.Pino, Marbot, et al., 200230. m/0.25 mm/0.25 μm, He, 60. C @ 2. min, 4. K/min, 250. C @ 20. min

References

Pino, Marbot, et al., 2002
Pino, J.; Marbot, R.; Rosado, A., Volatile constituents of star apple (Chrysophyllum cainito L.) from Cuba, Flavour Fragr. J., 2002, 17, 5, 401-403, https://doi.org/10.1002/ffj.1116 . [all data]